{"text_format":"1","workbook":"xlsx","n_sheets":46,"sheets":["Start","Blad1","Drag","Logik","Visualisering","Stat","SpelBraden","RensaHistorik","RVB","RVL","RVD","RVK","RVS","P_A1","P_B1","P_C1","P_D1","P_E1","P_F1","P_G1","P_H1","P_A8","P_B8","P_C8","P_D8","P_E8","P_F8","P_G8","P_H8","P_A2","P_B2","P_C2","P_D2","P_E2","P_F2","P_G2","P_H2","P_A7","P_B7","P_C7","P_D7","P_E7","P_F7","P_G7","P_H7","Blad11"],"not_rendered":{"charts":0,"images":1,"macros":1,"external_links":0,"defined_names":32,"comments":0,"pivot_tables":0},"unopened":[],"bounds":{"document_bytes":16777216,"sheet_cells":100000,"rows_first":2000,"rows_last":500,"rows_between":2000,"halvings":0,"cell_chars":16384,"cell_head_chars":4096},"cells_cut":0,"cells_raw":0,"read":"whole","date_system":"1900"}

{"sheet":"Start","index":0,"n_rows":31,"n_cols":18,"rows_kept":31,"cut":false,"hidden":false,"merged":[[30,15,36,22],[0,6,0,13],[4,15,11,15],[1,6,1,13],[7,17,7,22],[8,17,8,22],[9,17,9,22],[10,17,10,22],[11,17,11,22],[0,15,1,22],[14,15,27,22]]}
[null,null,null,null,null,"Eaten:",{"$f":"Visualisering!X17","v":""},null,null,null,null,null,null,null,null,"Excel Formula Chess Engine v0.1 - Peter Larsen 2015"]
[null,null,null,null,null,null,{"$f":"Visualisering!X20","v":""}]
[null,null,null,null,null,null,0,1,2,3,4,5,6,7]
[null,null,null,null,null,null,"A","B","C","D","E","F","G","H",null,"History",null,"Next Move"]
[null,null,null,null,0,8,{"$f":"OFFSET(Visualisering!$F$35,$E5,G$3)","v":"♜"},{"$f":"OFFSET(Visualisering!$F$35,$E5,H$3)","v":"♞"},{"$f":"OFFSET(Visualisering!$F$35,$E5,I$3)","v":"♝"},{"$f":"OFFSET(Visualisering!$F$35,$E5,J$3)","v":"♛"},{"$f":"OFFSET(Visualisering!$F$35,$E5,K$3)","v":"♚"},{"$f":"OFFSET(Visualisering!$F$35,$E5,L$3)","v":"♝"},{"$f":"OFFSET(Visualisering!$F$35,$E5,M$3)","v":"♞"},{"$f":"OFFSET(Visualisering!$F$35,$E5,N$3)","v":"♜"},8]
[null,null,null,null,-1,7,{"$f":"OFFSET(Visualisering!$F$35,$E6,G$3)","v":"♟"},{"$f":"OFFSET(Visualisering!$F$35,$E6,H$3)","v":"♟"},{"$f":"OFFSET(Visualisering!$F$35,$E6,I$3)","v":"♟"},{"$f":"OFFSET(Visualisering!$F$35,$E6,J$3)","v":"♟"},{"$f":"OFFSET(Visualisering!$F$35,$E6,K$3)","v":"♟"},{"$f":"OFFSET(Visualisering!$F$35,$E6,L$3)","v":"♟"},{"$f":"OFFSET(Visualisering!$F$35,$E6,M$3)","v":"♟"},{"$f":"OFFSET(Visualisering!$F$35,$E6,N$3)","v":"♟"},7]
[null,null,"Move","Next",-2,6,{"$f":"OFFSET(Visualisering!$F$35,$E7,G$3)","v":""},{"$f":"OFFSET(Visualisering!$F$35,$E7,H$3)","v":""},{"$f":"OFFSET(Visualisering!$F$35,$E7,I$3)","v":""},{"$f":"OFFSET(Visualisering!$F$35,$E7,J$3)","v":""},{"$f":"OFFSET(Visualisering!$F$35,$E7,K$3)","v":""},{"$f":"OFFSET(Visualisering!$F$35,$E7,L$3)","v":""},{"$f":"OFFSET(Visualisering!$F$35,$E7,M$3)","v":""},{"$f":"OFFSET(Visualisering!$F$35,$E7,N$3)","v":""},6]
[null,null,100,{"$f":"IF(ISODD(aDragNr),\"Black\",\"White\")","v":"White"},-3,5,{"$f":"OFFSET(Visualisering!$F$35,$E8,G$3)","v":""},{"$f":"OFFSET(Visualisering!$F$35,$E8,H$3)","v":""},{"$f":"OFFSET(Visualisering!$F$35,$E8,I$3)","v":""},{"$f":"OFFSET(Visualisering!$F$35,$E8,J$3)","v":""},{"$f":"OFFSET(Visualisering!$F$35,$E8,K$3)","v":""},{"$f":"OFFSET(Visualisering!$F$35,$E8,L$3)","v":""},{"$f":"OFFSET(Visualisering!$F$35,$E8,M$3)","v":""},{"$f":"OFFSET(Visualisering!$F$35,$E8,N$3)","v":""},5,null,null,"Instruction - How to play"]
[null,null,null,null,-4,4,{"$f":"OFFSET(Visualisering!$F$35,$E9,G$3)","v":""},{"$f":"OFFSET(Visualisering!$F$35,$E9,H$3)","v":""},{"$f":"OFFSET(Visualisering!$F$35,$E9,I$3)","v":""},{"$f":"OFFSET(Visualisering!$F$35,$E9,J$3)","v":""},{"$f":"OFFSET(Visualisering!$F$35,$E9,K$3)","v":""},{"$f":"OFFSET(Visualisering!$F$35,$E9,L$3)","v":""},{"$f":"OFFSET(Visualisering!$F$35,$E9,M$3)","v":""},{"$f":"OFFSET(Visualisering!$F$35,$E9,N$3)","v":""},4,null,null,"1. Enter your move in \"History\"-box, example: D2D4"]
[null,null,null,null,-5,3,{"$f":"OFFSET(Visualisering!$F$35,$E10,G$3)","v":""},{"$f":"OFFSET(Visualisering!$F$35,$E10,H$3)","v":""},{"$f":"OFFSET(Visualisering!$F$35,$E10,I$3)","v":""},{"$f":"OFFSET(Visualisering!$F$35,$E10,J$3)","v":""},{"$f":"OFFSET(Visualisering!$F$35,$E10,K$3)","v":""},{"$f":"OFFSET(Visualisering!$F$35,$E10,L$3)","v":""},{"$f":"OFFSET(Visualisering!$F$35,$E10,M$3)","v":""},{"$f":"OFFSET(Visualisering!$F$35,$E10,N$3)","v":""},3,null,null,"2. Hit \"Move!\"-button to let chess engine make move"]
[null,null,null,null,-6,2,{"$f":"OFFSET(Visualisering!$F$35,$E11,G$3)","v":"♙"},{"$f":"OFFSET(Visualisering!$F$35,$E11,H$3)","v":"♙"},{"$f":"OFFSET(Visualisering!$F$35,$E11,I$3)","v":"♙"},{"$f":"OFFSET(Visualisering!$F$35,$E11,J$3)","v":"♙"},{"$f":"OFFSET(Visualisering!$F$35,$E11,K$3)","v":"♙"},{"$f":"OFFSET(Visualisering!$F$35,$E11,L$3)","v":"♙"},{"$f":"OFFSET(Visualisering!$F$35,$E11,M$3)","v":"♙"},{"$f":"OFFSET(Visualisering!$F$35,$E11,N$3)","v":"♙"},2,null,null,"3. Wait a minute!"]
[null,null,null,null,-7,1,{"$f":"OFFSET(Visualisering!$F$35,$E12,G$3)","v":"♖"},{"$f":"OFFSET(Visualisering!$F$35,$E12,H$3)","v":"♘"},{"$f":"OFFSET(Visualisering!$F$35,$E12,I$3)","v":"♗"},{"$f":"OFFSET(Visualisering!$F$35,$E12,J$3)","v":"♕"},{"$f":"OFFSET(Visualisering!$F$35,$E12,K$3)","v":"♔"},{"$f":"OFFSET(Visualisering!$F$35,$E12,L$3)","v":"♗"},{"$f":"OFFSET(Visualisering!$F$35,$E12,M$3)","v":"♘"},{"$f":"OFFSET(Visualisering!$F$35,$E12,N$3)","v":"♖"},1,null,null,"4. Repeat from (1.) , add your next move after current moves"]
[null,null,null,null,null,null,"A","B","C","D","E","F","G","H"]
[null,null,null,null,null,null,null,null,null,null,null,null,null,null,null,"Take Notes:"]
[null,null,null,null,null,null,"White",null,null,null,null,null,null,"Black",null,"Example run:\nd2d4 e7e6 d1d2 d8f6 g1f3 f8d6 d2c3 b8c6 e2e4 c6d4 c3d4 f6d4 f3d4 f7f6 e1e2 e6e5 d4f5 e8f8 f2f4 g8h6 f5d6 c7d6 f4e5 g7g5 e5e6 d7e6 c1g5 f6g5 b1c3 f8f7 e4e5 h6f5 e2d2 c8d7 c3e4 f7g7 c2c4 h7h5 e4g5 g7g6 h2h4 d6e5 h1h3 d7c6 f1d3 a8d8 d2e1 d8d3 h3d3"]
[null,null,null,null,null,"Points",{"$f":"Logik!B3","v":23900},null,null,null,null,null,null,{"$f":"Logik!C3","v":23900}]
[null,null,null,null,null,"PosPoints",{"$f":"Logik!B4","v":92},null,null,null,null,null,null,{"$f":"Logik!C4","v":92}]
[null,null,null,null,null,"Attack",{"$f":"Stat!H37","v":0},null,null,null,null,null,null,{"$f":"Stat!H38","v":0}]
[null,null,null,null,null,"Defence",{"$f":"Stat!G37","v":215.8},null,null,null,null,null,null,{"$f":"Stat!G38","v":215.8}]
[null,null,null,null,null,"AttackKing",{"$f":"Stat!I37","v":444.58152958152948},null,null,null,null,null,null,{"$f":"Stat!I38","v":444.58152958152954}]
[null,null,null,null,null,"Possibilities",{"$f":"Drag!E19*10","v":200},null,null,null,null,null,null,{"$f":"Drag!H19*10","v":200}]
[null,null,null,null,null,"Check",{"$f":"200*schackSvart","v":0},null,null,null,null,null,null,{"$f":"200*schackVit","v":0}]
[null,null,null,null,null,"Avg.",{"$f":"Stat!J37","v":240},null,null,null,null,null,null,{"$f":"Stat!J38","v":240}]
[null,null,null,null,null,"Avg.",{"$f":"Stat!K37","v":256},null,null,null,null,null,null,{"$f":"Stat!K38","v":256}]
[null,null,null,null,null,"IsChecked",{"$f":"-10000*schackVit","v":0},null,null,null,null,null,null,{"$f":"-10000*schackSvart","v":0}]
[null,null,null,null,null,"PossibleMoves",{"$f":"Stat!M37/50","v":56},null,null,null,null,null,null,{"$f":"Stat!M38/50","v":56}]
[]
[null,null,null,null,null,"Sum",{"$f":"ROUND(SUM(G16:G26),0)","v":25404},null,null,null,null,null,null,{"$f":"ROUND(SUM(N16:N26),0)","v":25404}]
[]
[null,null,null,null,null,"PossibleMoves",{"$f":"IF(ISODD(dragnr),\"\",Drag!E19)","v":20},null,null,null,null,null,null,{"$f":"IF(ISODD(dragnr),Drag!H19,\"\")","v":""},null,"Todo: (not working/implemented yet!)"]
[null,null,null,null,null,null,null,null,null,null,null,null,null,null,null,"En passant\nCastling\nPromotion\nStalemate-detection\nCheck mate detection\n3-times repeat rule\n50-moves without moving any pawn - detection"]

{"sheet":"Blad1","index":1,"n_rows":0,"n_cols":0,"rows_kept":0,"cut":false,"hidden":true,"merged":[]}

{"sheet":"Drag","index":2,"n_rows":55,"n_cols":64,"rows_kept":55,"cut":false,"hidden":true,"merged":[]}
["Positioner",null,null,"Möjliga drag",null,null,null,null,null,"Schack",null,null,"AllaDrag","Vit",{"$f":"F3&F4&F5&F6&F7&F8&F9&F10&F12&F11&F13&F14&F15&F16&F17&F18","v":"A3C3F3H3B3B4A3A4C3C4D3D4E3E4F3F4G3G4H3H4"}]
["Vit","Svart",null,"Vit",null,null,"Svart",null,null,"Vit","Svart",null,null,"Svart",{"$f":"I3&I4&I5&I6&I7&I8&I9&I10&I11&I12&I13&I14&I15&I16&I17&I18","v":"A6A5B6B5C6C5D6D5E6E5F6F5G6G5H6H5A6C6F6H6"}]
[{"$f":"OFFSET(Logik!$D$1,0,C3)","v":"A1"},{"$f":"OFFSET(Logik!$D$1,0,C3+16)","v":"A7"},1,"A1",{"$f":"P_A1!E14","v":0},{"$f":"P_A1!E13","v":""},"A7",{"$f":"P_A7!E14","v":2},{"$f":"P_A7!E13","v":"A6A5"},{"$f":"IFERROR(FIND($A$7,I3),\"\")","v":""},{"$f":"IFERROR(FIND($B$15,F3),\"\")","v":""},null,null,{"$f":"IF(I3<>\"\",COUNTIF($F$3:$F$18,\"*\"&RIGHT(I3,2)&\"*\"),\"\")","v":0},{"$f":"OFFSET(Logik!$D$3,0,C3)","v":500},{"$f":"$O3-P$19","v":400},{"$f":"$O3-Q$19","v":400},400,400,400,400,400,400,0,200,200,-400,-19500,200,200,0]
[{"$f":"OFFSET(Logik!$D$1,0,C4)","v":"B1"},{"$f":"OFFSET(Logik!$D$1,0,C4+16)","v":"B7"},2,"B1",{"$f":"P_B1!E14","v":2},{"$f":"P_B1!E13","v":"A3C3"},"B7",{"$f":"P_B7!E14","v":2},{"$f":"P_B7!E13","v":"B6B5"},{"$f":"IFERROR(FIND($A$7,I4),\"\")","v":""},{"$f":"IFERROR(FIND($B$15,F4),\"\")","v":""},null,null,{"$f":"IF(I4<>\"\",COUNTIF($F$3:$F$18,\"*\"&I4&\"*\"),\"\")","v":0},{"$f":"OFFSET(Logik!$D$3,0,C4)","v":300},{"$f":"$O4-P$19","v":200},200,200,200,200,200,200,200,-200,0,0,-600,-19700,0,0,-200]
[{"$f":"OFFSET(Logik!$D$1,0,C5)","v":"C1"},{"$f":"OFFSET(Logik!$D$1,0,C5+16)","v":"C7"},3,"C1",{"$f":"P_C1!E27","v":0},{"$f":"P_C1!E26","v":""},"C7",{"$f":"P_C7!E14","v":2},{"$f":"P_C7!E13","v":"C6C5"},"","",null,null,0,{"$f":"OFFSET(Logik!$D$3,0,C5)","v":300},200,200,200,200,200,200,200,200,-200,0,0,-600,-19700,0,0,-200]
[{"$f":"OFFSET(Logik!$D$1,0,C6)","v":"D1"},{"$f":"OFFSET(Logik!$D$1,0,C6+16)","v":"D7"},4,"D1",{"$f":"P_D1!E27","v":0},{"$f":"P_D1!E26","v":""},"D7",{"$f":"P_D7!E14","v":2},{"$f":"P_D7!E13","v":"D6D5"},"","",null,null,0,{"$f":"OFFSET(Logik!$D$3,0,C6)","v":900},800,800,800,800,800,800,800,800,400,600,600,0,-19100,600,600,400]
[{"$f":"OFFSET(Logik!$D$1,0,C7)","v":"E1"},{"$f":"OFFSET(Logik!$D$1,0,C7+16)","v":"E7"},5,"E1",{"$f":"P_E1!E27","v":0},{"$f":"P_E1!E26","v":""},"E7",{"$f":"P_E7!E14","v":2},{"$f":"P_E7!E13","v":"E6E5"},"","",null,null,0,{"$f":"OFFSET(Logik!$D$3,0,C7)","v":20000},19900,19900,19900,19900,19900,19900,19900,19900,19500,19700,19700,19100,0,19700,19700,19500]
[{"$f":"OFFSET(Logik!$D$1,0,C8)","v":"F1"},{"$f":"OFFSET(Logik!$D$1,0,C8+16)","v":"F7"},6,"F1",{"$f":"P_F1!E27","v":0},{"$f":"P_F1!E26","v":""},"F7",{"$f":"P_F7!E14","v":2},{"$f":"P_F7!E13","v":"F6F5"},"","",null,null,0,{"$f":"OFFSET(Logik!$D$3,0,C8)","v":300},200,200,200,200,200,200,200,200,-200,0,0,-600,-19700,0,0,-200]
[{"$f":"OFFSET(Logik!$D$1,0,C9)","v":"G1"},{"$f":"OFFSET(Logik!$D$1,0,C9+16)","v":"G7"},7,"G1",{"$f":"P_G1!E14","v":2},{"$f":"P_G1!E13","v":"F3H3"},"G7",{"$f":"P_G7!E14","v":2},{"$f":"P_G7!E13","v":"G6G5"},"","",null,null,0,{"$f":"OFFSET(Logik!$D$3,0,C9)","v":300},200,200,200,200,200,200,200,200,-200,0,0,-600,-19700,0,0,-200]
[{"$f":"OFFSET(Logik!$D$1,0,C10)","v":"H1"},{"$f":"OFFSET(Logik!$D$1,0,C10+16)","v":"H7"},8,"H1",{"$f":"P_H1!E14","v":0},{"$f":"P_H1!E13","v":""},"H7",{"$f":"P_H7!E14","v":2},{"$f":"P_H7!E13","v":"H6H5"},"","",null,null,0,{"$f":"OFFSET(Logik!$D$3,0,C10)","v":500},400,400,400,400,400,400,400,400,0,200,200,-400,-19500,200,200,0]
[{"$f":"OFFSET(Logik!$D$1,0,C11)","v":"A2"},{"$f":"OFFSET(Logik!$D$1,0,C11+16)","v":"A8"},9,"A2",{"$f":"P_A2!E14","v":2},{"$f":"P_A2!E13","v":"A3A4"},"A8",{"$f":"P_A8!E14","v":0},{"$f":"P_A8!E13","v":""},"","",null,null,"",{"$f":"OFFSET(Logik!$D$3,0,C11)","v":100},0,0,0,0,0,0,0,0,-400,-200,-200,-800,-19900,-200,-200,-400]
[{"$f":"OFFSET(Logik!$D$1,0,C12)","v":"B2"},{"$f":"OFFSET(Logik!$D$1,0,C12+16)","v":"B8"},10,"B2",{"$f":"P_B2!E14","v":2},{"$f":"P_B2!E13","v":"B3B4"},"B8",{"$f":"P_B8!E14","v":2},{"$f":"P_B8!E13","v":"A6C6"},"","",null,null,0,{"$f":"OFFSET(Logik!$D$3,0,C12)","v":100},0,0,0,0,0,0,0,0,-400,-200,-200,-800,-19900,-200,-200,-400]
[{"$f":"OFFSET(Logik!$D$1,0,C13)","v":"C2"},{"$f":"OFFSET(Logik!$D$1,0,C13+16)","v":"C8"},11,"C2",{"$f":"P_C2!E14","v":2},{"$f":"P_C2!E13","v":"C3C4"},"C8",{"$f":"P_C8!E27","v":0},{"$f":"P_C8!E26","v":""},"","",null,null,"",{"$f":"OFFSET(Logik!$D$3,0,C13)","v":100},0,0,0,0,0,0,0,0,-400,-200,-200,-800,-19900,-200,-200,-400]
[{"$f":"OFFSET(Logik!$D$1,0,C14)","v":"D2"},{"$f":"OFFSET(Logik!$D$1,0,C14+16)","v":"D8"},12,"D2",{"$f":"P_D2!E14","v":2},{"$f":"P_D2!E13","v":"D3D4"},"D8",{"$f":"P_D8!E27","v":0},{"$f":"P_D8!E26","v":""},"","",null,null,"",{"$f":"OFFSET(Logik!$D$3,0,C14)","v":100},0,0,0,0,0,0,0,0,-400,-200,-200,-800,-19900,-200,-200,-400]
[{"$f":"OFFSET(Logik!$D$1,0,C15)","v":"E2"},{"$f":"OFFSET(Logik!$D$1,0,C15+16)","v":"E8"},13,"E2",{"$f":"P_E2!E14","v":2},{"$f":"P_E2!E13","v":"E3E4"},"E8",{"$f":"P_E8!E27","v":0},{"$f":"P_E8!E26","v":""},"","",null,null,"",{"$f":"OFFSET(Logik!$D$3,0,C15)","v":100},0,0,0,0,0,0,0,0,-400,-200,-200,-800,-19900,-200,-200,-400]
[{"$f":"OFFSET(Logik!$D$1,0,C16)","v":"F2"},{"$f":"OFFSET(Logik!$D$1,0,C16+16)","v":"F8"},14,"F2",{"$f":"P_F2!E14","v":2},{"$f":"P_F2!E13","v":"F3F4"},"F8",{"$f":"P_F8!E27","v":0},{"$f":"P_F8!E26","v":""},"","",null,null,"",{"$f":"OFFSET(Logik!$D$3,0,C16)","v":100},0,0,0,0,0,0,0,0,-400,-200,-200,-800,-19900,-200,-200,-400]
[{"$f":"OFFSET(Logik!$D$1,0,C17)","v":"G2"},{"$f":"OFFSET(Logik!$D$1,0,C17+16)","v":"G8"},15,"G2",{"$f":"P_G2!E14","v":2},{"$f":"P_G2!E13","v":"G3G4"},"G8",{"$f":"P_G8!E14","v":2},{"$f":"P_G8!E13","v":"F6H6"},"","",null,null,0,{"$f":"OFFSET(Logik!$D$3,0,C17)","v":100},0,0,0,0,0,0,0,0,-400,-200,-200,-800,-19900,-200,-200,-400]
[{"$f":"OFFSET(Logik!$D$1,0,C18)","v":"H2"},{"$f":"OFFSET(Logik!$D$1,0,C18+16)","v":"H8"},16,"H2",{"$f":"P_H2!E14","v":2},{"$f":"P_H2!E13","v":"H3H4"},"H8",{"$f":"P_H8!E14","v":0},{"$f":"P_H8!E13","v":""},"","",null,null,"",{"$f":"OFFSET(Logik!$D$3,0,C18)","v":100},0,0,0,0,0,0,0,0,-400,-200,-200,-800,-19900,-200,-200,-400]
[null,null,null,"Summa:",{"$f":"SUM(E3:E18)","v":20},null,"Summa:",{"$f":"SUM(H3:H18)","v":20},null,{"$f":"16-COUNTIF(J3:J18,\"\")","v":0},{"$f":"16-COUNTIF(K3:K18,\"\")","v":0},null,null,null,null,{"$f":"OFFSET(Logik!$D$3,0,$C3+16)","v":100},{"$f":"OFFSET(Logik!$D$3,0,$C4+16)","v":100},{"$f":"OFFSET(Logik!$D$3,0,$C5+16)","v":100},{"$f":"OFFSET(Logik!$D$3,0,$C6+16)","v":100},{"$f":"OFFSET(Logik!$D$3,0,$C7+16)","v":100},{"$f":"OFFSET(Logik!$D$3,0,$C8+16)","v":100},{"$f":"OFFSET(Logik!$D$3,0,$C9+16)","v":100},{"$f":"OFFSET(Logik!$D$3,0,$C10+16)","v":100},{"$f":"OFFSET(Logik!$D$3,0,$C11+16)","v":500},{"$f":"OFFSET(Logik!$D$3,0,$C12+16)","v":300},{"$f":"OFFSET(Logik!$D$3,0,$C13+16)","v":300},{"$f":"OFFSET(Logik!$D$3,0,$C14+16)","v":900},{"$f":"OFFSET(Logik!$D$3,0,$C15+16)","v":20000},{"$f":"OFFSET(Logik!$D$3,0,$C16+16)","v":300},{"$f":"OFFSET(Logik!$D$3,0,$C17+16)","v":300},{"$f":"OFFSET(Logik!$D$3,0,$C18+16)","v":500}]
[null,null,null,null,null,null,null,null,1,3,5,7,9,11,13,15,17,19,21,23,25,27,29,31,33,35,37,39,41,43,45,47,49,51,53,55]
[null,null,null,null,null,null,"Total",null,{"$f":"IF(MID(LOWER($I3),I$20,2) <> LOWER($A$7),IF(I$20<LEN($I3),LOWER($B3)&MID(LOWER($I3),I$20,2),\"\"),\"\")","v":"a7a6"},{"$f":"IF(MID(LOWER($I3),J$20,2) <> LOWER($A$7),IF(J$20<LEN($I3),LOWER($B3)&MID(LOWER($I3),J$20,2),\"\"),\"\")","v":"a7a5"},"","","","","","","","","","","","","","","","","","","","","","","","","","",{"$f":"I21","v":"a7a6"},{"$f":"AK21&J21","v":"a7a6a7a5"},{"$f":"AL21&K21","v":"a7a6a7a5"},"a7a6a7a5","a7a6a7a5","a7a6a7a5","a7a6a7a5","a7a6a7a5",{"$f":"AR21&Q21","v":"a7a6a7a5"},{"$f":"AS21&R21","v":"a7a6a7a5"},{"$f":"AT21&S21","v":"a7a6a7a5"},{"$f":"AU21&T21","v":"a7a6a7a5"},{"$f":"AV21&U21","v":"a7a6a7a5"},{"$f":"AW21&V21","v":"a7a6a7a5"},{"$f":"AX21&W21","v":"a7a6a7a5"},"a7a6a7a5",{"$f":"AZ21&Y21","v":"a7a6a7a5"},{"$f":"BA21&Z21","v":"a7a6a7a5"},{"$f":"BB21&AA21","v":"a7a6a7a5"},{"$f":"BC21&AB21","v":"a7a6a7a5"},{"$f":"BD21&AC21","v":"a7a6a7a5"},{"$f":"BE21&AD21","v":"a7a6a7a5"},"a7a6a7a5",{"$f":"BG21&AF21","v":"a7a6a7a5"},{"$f":"BH21&AG21","v":"a7a6a7a5"},{"$f":"BI21&AH21","v":"a7a6a7a5"},{"$f":"BJ21&AI21","v":"a7a6a7a5"},{"$f":"BK21&AJ21","v":"a7a6a7a5"}]
[null,null,null,null,null,null,"Svart",null,{"$f":"IF(MID(LOWER($I4),I$20,2) <> LOWER($A$7),IF(I$20<LEN($I4),LOWER($B4)&MID(LOWER($I4),I$20,2),\"\"),\"\")","v":"b7b6"},"b7b5","","","","","","","","","","","","","","","","","","","","","","","","","","",{"$f":"I22","v":"b7b6"},{"$f":"AK22&J22","v":"b7b6b7b5"},"b7b6b7b5","b7b6b7b5","b7b6b7b5","b7b6b7b5","b7b6b7b5","b7b6b7b5","b7b6b7b5","b7b6b7b5","b7b6b7b5","b7b6b7b5","b7b6b7b5","b7b6b7b5","b7b6b7b5","b7b6b7b5","b7b6b7b5","b7b6b7b5","b7b6b7b5","b7b6b7b5","b7b6b7b5","b7b6b7b5","b7b6b7b5","b7b6b7b5","b7b6b7b5","b7b6b7b5","b7b6b7b5","b7b6b7b5"]
[null,null,null,null,null,null,null,null,"c7c6","c7c5","","","","","","","","","","","","","","","","","","","","","","","","","","","c7c6","c7c6c7c5","c7c6c7c5","c7c6c7c5","c7c6c7c5","c7c6c7c5","c7c6c7c5","c7c6c7c5","c7c6c7c5","c7c6c7c5","c7c6c7c5","c7c6c7c5","c7c6c7c5","c7c6c7c5","c7c6c7c5","c7c6c7c5","c7c6c7c5","c7c6c7c5","c7c6c7c5","c7c6c7c5","c7c6c7c5","c7c6c7c5","c7c6c7c5","c7c6c7c5","c7c6c7c5","c7c6c7c5","c7c6c7c5","c7c6c7c5"]
[null,null,null,null,null,null,null,null,"d7d6","d7d5","","","","","","","","","","","","","","","","","","","","","","","","","","","d7d6","d7d6d7d5","d7d6d7d5","d7d6d7d5","d7d6d7d5","d7d6d7d5","d7d6d7d5","d7d6d7d5","d7d6d7d5","d7d6d7d5","d7d6d7d5","d7d6d7d5","d7d6d7d5","d7d6d7d5","d7d6d7d5","d7d6d7d5","d7d6d7d5","d7d6d7d5","d7d6d7d5","d7d6d7d5","d7d6d7d5","d7d6d7d5","d7d6d7d5","d7d6d7d5","d7d6d7d5","d7d6d7d5","d7d6d7d5","d7d6d7d5"]
[null,null,null,null,null,null,null,null,"e7e6","e7e5","","","","","","","","","","","","","","","","","","","","","","","","","","","e7e6","e7e6e7e5","e7e6e7e5","e7e6e7e5","e7e6e7e5","e7e6e7e5","e7e6e7e5","e7e6e7e5","e7e6e7e5","e7e6e7e5","e7e6e7e5","e7e6e7e5","e7e6e7e5","e7e6e7e5","e7e6e7e5","e7e6e7e5","e7e6e7e5","e7e6e7e5","e7e6e7e5","e7e6e7e5","e7e6e7e5","e7e6e7e5","e7e6e7e5","e7e6e7e5","e7e6e7e5","e7e6e7e5","e7e6e7e5","e7e6e7e5"]
[null,null,null,null,null,null,null,null,"f7f6","f7f5","","","","","","","","","","","","","","","","","","","","","","","","","","","f7f6","f7f6f7f5","f7f6f7f5","f7f6f7f5","f7f6f7f5","f7f6f7f5","f7f6f7f5","f7f6f7f5","f7f6f7f5","f7f6f7f5","f7f6f7f5","f7f6f7f5","f7f6f7f5","f7f6f7f5","f7f6f7f5","f7f6f7f5","f7f6f7f5","f7f6f7f5","f7f6f7f5","f7f6f7f5","f7f6f7f5","f7f6f7f5","f7f6f7f5","f7f6f7f5","f7f6f7f5","f7f6f7f5","f7f6f7f5","f7f6f7f5"]
[null,null,null,null,null,null,null,null,"g7g6","g7g5","","","","","","","","","","","","","","","","","","","","","","","","","","","g7g6","g7g6g7g5","g7g6g7g5","g7g6g7g5","g7g6g7g5","g7g6g7g5","g7g6g7g5","g7g6g7g5","g7g6g7g5","g7g6g7g5","g7g6g7g5","g7g6g7g5","g7g6g7g5","g7g6g7g5","g7g6g7g5","g7g6g7g5","g7g6g7g5","g7g6g7g5","g7g6g7g5","g7g6g7g5","g7g6g7g5","g7g6g7g5","g7g6g7g5","g7g6g7g5","g7g6g7g5","g7g6g7g5","g7g6g7g5","g7g6g7g5"]
[null,null,null,null,null,null,null,null,"h7h6","h7h5","","","","","","","","","","","","","","","","","","","","","","","","","","","h7h6","h7h6h7h5","h7h6h7h5","h7h6h7h5","h7h6h7h5","h7h6h7h5","h7h6h7h5","h7h6h7h5","h7h6h7h5","h7h6h7h5","h7h6h7h5","h7h6h7h5","h7h6h7h5","h7h6h7h5","h7h6h7h5","h7h6h7h5","h7h6h7h5","h7h6h7h5","h7h6h7h5","h7h6h7h5","h7h6h7h5","h7h6h7h5","h7h6h7h5","h7h6h7h5","h7h6h7h5","h7h6h7h5","h7h6h7h5","h7h6h7h5"]
[null,null,null,null,null,null,null,null,"","","","","","","","","","","","","","","","","","","","","","","","","","","","","","","","","","","","","","","","","","","","","","","","","","","","","","","",""]
[null,null,null,null,null,null,null,null,"b8a6","b8c6","","","","","","","","","","","","","","","","","","","","","","","","","","","b8a6","b8a6b8c6","b8a6b8c6","b8a6b8c6","b8a6b8c6","b8a6b8c6","b8a6b8c6","b8a6b8c6","b8a6b8c6","b8a6b8c6","b8a6b8c6","b8a6b8c6","b8a6b8c6","b8a6b8c6","b8a6b8c6","b8a6b8c6","b8a6b8c6","b8a6b8c6","b8a6b8c6","b8a6b8c6","b8a6b8c6","b8a6b8c6","b8a6b8c6","b8a6b8c6","b8a6b8c6","b8a6b8c6","b8a6b8c6","b8a6b8c6"]
[null,null,null,null,null,null,null,null,"",{"$f":"IF(MID(LOWER($I13),J$20,2) <> LOWER($A$7),IF(J$20<LEN($I13),LOWER($B13)&MID(LOWER($I13),J$20,2),\"\"),\"\")","v":""},"","","","","","","","","","","","","","","","","","","","","","","","","","","","","","","","","","","","","","","","","","","","","","","","","","","","","",""]
[null,null,null,null,null,null,null,null,"","","","","","","","","","","","","","","","","","","","","","","","","","","","","","","","","","","","","","","","","","","","","","","","","","","","","","","",""]
[null,null,null,null,null,null,null,null,"","","","","","","","","","","","","","","","","","","","","","","","","","","","","","","","","","","","","","","","","","","","","","","","","","","","","","","",""]
[null,null,null,null,null,null,null,null,"","","","","","","","","","","","","","","","","","","","","","","","","","","","","","","","","","","","","","","","","","","","","","","","","","","","","","","",""]
[null,null,null,null,null,null,null,null,"g8f6","g8h6","","","","","","","","","","","","","","","","","","","","","","","","","","","g8f6","g8f6g8h6","g8f6g8h6","g8f6g8h6","g8f6g8h6","g8f6g8h6","g8f6g8h6","g8f6g8h6","g8f6g8h6","g8f6g8h6","g8f6g8h6","g8f6g8h6","g8f6g8h6","g8f6g8h6","g8f6g8h6","g8f6g8h6","g8f6g8h6","g8f6g8h6","g8f6g8h6","g8f6g8h6","g8f6g8h6","g8f6g8h6","g8f6g8h6","g8f6g8h6","g8f6g8h6","g8f6g8h6","g8f6g8h6","g8f6g8h6"]
[null,null,null,null,null,null,null,null,"","","","","","","","","","","","","","","","","","","","","","","","","","","","","","","","","","","","","","","","","","","","","","","","","","","","","","","",""]
[null,null,null,null,null,null,null,null,null,null,null,null,null,null,null,null,null,null,null,null,null,null,null,null,null,null,null,null,null,null,null,null,null,null,null,null,null,null,null,null,null,null,null,null,null,null,null,null,null,null,null,null,null,null,null,null,null,null,null,null,null,null,null,{"$f":"BL21&BL22&BL23&BL24&BL25&BL26&BL27&BL28&BL29&BL30&BL31&BL32&BL33&BL34&BL35&BL36","v":"a7a6a7a5b7b6b7b5c7c6c7c5d7d6d7d5e7e6e7e5f7f6f7f5g7g6g7g5h7h6h7h5b8a6b8c6g8f6g8h6"}]
[null,null,null,null,null,null,"Total",null,{"$f":"IF(MID(LOWER($F3),I$20,2) <> LOWER($B$15),IF(I$20<LEN($F3),LOWER($A3)&MID(LOWER($F3),I$20,2),\"\"),\"\")","v":""},{"$f":"IF(MID(LOWER($F3),J$20,2) <> LOWER($B$15),IF(J$20<LEN($F3),LOWER($A3)&MID(LOWER($F3),J$20,2),\"\"),\"\")","v":""},"","","","","","","","","","","","","","","","","","","","","","","","","",""]
[null,null,null,null,null,null,"Vit",null,{"$f":"IF(MID(LOWER($F4),I$20,2) <> LOWER($B$15),IF(I$20<LEN($F4),LOWER($A4)&MID(LOWER($F4),I$20,2),\"\"),\"\")","v":"b1a3"},"b1c3","","","","","","","","","","","","","","","","","","","","","","","","","",""]
[null,null,null,null,null,null,null,null,"","","","","","","","","","","","","","","","","","","","","","","","","","","",""]
[null,null,null,null,null,null,null,null,"","","","","","","","","","","","","","","","","","","","","","","","","","","",""]
[null,null,null,null,null,null,null,null,"","","","","","","","","","","","","","","","","","","","","","","","","","","",""]
[null,null,null,null,null,null,null,null,"","","","","","","","","","","","","","","","","","","","","","","","","","","",""]
[null,null,null,null,null,null,null,null,"g1f3","g1h3","","","","","","","","","","","","","","","","","","","","","","","","","",""]
[null,null,null,null,null,null,null,null,"","","","","","","","","","","","","","","","","","","","","","","","","","","",""]
[null,null,null,null,null,null,null,null,"a2a3","a2a4","","","","","","","","","","","","","","","","","","","","","","","","","",""]
[null,null,null,null,null,null,null,null,"b2b3","b2b4","","","","","","","","","","","","","","","","","","","","","","","","","",""]
[null,null,null,null,null,null,null,null,"c2c3",{"$f":"IF(MID(LOWER($F13),J$20,2) <> LOWER($B$15),IF(J$20<LEN($F13),LOWER($A13)&MID(LOWER($F13),J$20,2),\"\"),\"\")","v":"c2c4"},"","","","","","","","","","","","","","","","","","","","","","","","","",""]
[null,null,null,null,null,null,null,null,"d2d3","d2d4","","","","","","","","","","","","","","","","","","","","","","","","","",""]
[null,null,null,null,null,null,null,null,"e2e3","e2e4","","","","","","","","","","","","","","","","","","","","","","","","","",""]
[null,null,null,null,null,null,null,null,"f2f3","f2f4","","","","","","","","","","","","","","","","","","","","","","","","","",""]
[null,null,null,null,null,null,null,null,"g2g3","g2g4","","","","","","","","","","","","","","","","","","","","","","","","","",""]
[null,null,null,null,null,null,null,null,"h2h3","h2h4","","","","","","","","","","","","","","","","","","","","","","","","","",""]
[null,null,null,null,null,null,null,null,{"$f":"IF(I$20<LEN($F19),$D19&MID($F19,I$20,2),\"\")","v":""},"","","","","","","","","","","","","","","","","","","","","","","","","","","","","","","","","","",""]
[null,null,null,null,null,null,null,null,{"$f":"IF(I$20<LEN($F20),$D20&MID($F20,I$20,2),\"\")","v":""},"","","","","","","","","","","","","","","","","","","","","","","","","","","","","","","","","","",""]

{"sheet":"Logik","index":3,"n_rows":62,"n_cols":129,"rows_kept":62,"cut":false,"hidden":true,"merged":[]}
[null,{"$f":"SUM(IF(E1:T1<>\"\",1,0))","v":16},{"$f":"SUM(IF(U1:AJ1<>\"\",1,0))","v":16},"Pos:",{"$f":"E18","v":"A1"},{"$f":"I18","v":"B1"},{"$f":"M18","v":"C1"},{"$f":"Q18","v":"D1"},{"$f":"U18","v":"E1"},{"$f":"Y18","v":"F1"},{"$f":"AC18","v":"G1"},{"$f":"AG18","v":"H1"},{"$f":"AK18","v":"A2"},{"$f":"AO18","v":"B2"},{"$f":"AS18","v":"C2"},{"$f":"AW18","v":"D2"},{"$f":"BA18","v":"E2"},{"$f":"BE18","v":"F2"},{"$f":"BI18","v":"G2"},{"$f":"BM18","v":"H2"},{"$f":"BQ18","v":"A7"},{"$f":"BU18","v":"B7"},{"$f":"BY18","v":"C7"},{"$f":"CC18","v":"D7"},{"$f":"CG18","v":"E7"},{"$f":"CK18","v":"F7"},{"$f":"CO18","v":"G7"},{"$f":"CS18","v":"H7"},{"$f":"CW18","v":"A8"},{"$f":"DA18","v":"B8"},{"$f":"DE18","v":"C8"},{"$f":"DI18","v":"D8"},{"$f":"DM18","v":"E8"},{"$f":"DQ18","v":"F8"},{"$f":"DU18","v":"G8"},{"$f":"DY18","v":"H8"}]
[null,null,null,"Pjas:","A1","B1","C1","D1","E1","F1","G1","H1","A2","B2","C2","D2","E2","F2","G2","H2","A7","B7","C7","D7","E7","F7","G7","H7","A8","B8","C8","D8","E8","F8","G8","H8"]
[null,{"$f":"SUM(E3:T3)","v":23900},{"$f":"SUM(U3:AJ3)","v":23900},"Poäng:",{"$f":"IF(E1<>\"\",HLOOKUP(HLOOKUP(E2,PjasStart,2,FALSE),Pjaser,3,FALSE),0)","v":500},300,300,900,20000,300,300,500,100,100,100,100,100,100,100,100,100,100,100,100,100,100,100,100,500,300,300,900,20000,300,300,500,null,null,null,null,null,null,null,null,null,null,null,null,null,null,null,null,null,null,null,null,null,null,null,null,null,null,null,null,null,null,null,null,null,null,null,null,null,null,null,null,null,null,"Test på \"en passant\"  på rad 9"]
[null,{"$f":"SUM(E4:T4)","v":92},{"$f":"SUM(U4:AJ4)","v":92},"PosPoäng:",{"$f":"IF(E1<>\"\",20-2*(ABS(ROW(INDIRECT(E1))-4.5)+ABS(COLUMN(INDIRECT(E1))-4.5)),0)","v":6},{"$f":"IF(F1<>\"\",20-2*(ABS(ROW(INDIRECT(F1))-4.5)+ABS(COLUMN(INDIRECT(F1))-4.5)),0)","v":8},{"$f":"IF(G1<>\"\",20-2*(ABS(ROW(INDIRECT(G1))-4.5)+ABS(COLUMN(INDIRECT(G1))-4.5)),0)","v":10},{"$f":"IF(H1<>\"\",20-2*(ABS(ROW(INDIRECT(H1))-4.5)+ABS(COLUMN(INDIRECT(H1))-4.5)),0)","v":12},{"$f":"IF(I1<>\"\",8*(ABS(ROW(INDIRECT(I1))-4.5)+ABS(COLUMN(INDIRECT(I1))-4.5)),0)","v":32},{"$f":"IF(J1<>\"\",20-2*(ABS(ROW(INDIRECT(J1))-4.5)+ABS(COLUMN(INDIRECT(J1))-4.5)),0)","v":10},8,6,{"$f":"IF(M1<>\"\",(_xlfn.NUMBERVALUE(RIGHT(M1,1))-2)*2,0)","v":0},{"$f":"IF(N1<>\"\",(_xlfn.NUMBERVALUE(RIGHT(N1,1))-2)*2,0)","v":0},0,0,0,0,0,0,{"$f":"IF(U1<>\"\",(7-_xlfn.NUMBERVALUE(RIGHT(U1,1)))*2,0)","v":0},{"$f":"IF(V1<>\"\",(7-_xlfn.NUMBERVALUE(RIGHT(V1,1)))*2,0)","v":0},0,0,0,0,0,0,{"$f":"IF(AC1<>\"\",20-2*(ABS(ROW(INDIRECT(AC1))-4.5)+ABS(COLUMN(INDIRECT(AC1))-4.5)),0)","v":6},{"$f":"IF(AD1<>\"\",20-2*(ABS(ROW(INDIRECT(AD1))-4.5)+ABS(COLUMN(INDIRECT(AD1))-4.5)),0)","v":8},10,12,{"$f":"IF(AG1<>\"\",8*(ABS(ROW(INDIRECT(AG1))-4.5)+ABS(COLUMN(INDIRECT(AG1))-4.5)),0)","v":32},10,8,6]
[null,null,null,"AttackKungP",{"$f":"IF(E1<>\"\",E3/(ABS(ROW(INDIRECT(E1))-ROW(INDIRECT($AG$1)))+ABS(COLUMN(INDIRECT(E1))-COLUMN(INDIRECT($AG$1)))),0)","v":45.454545454545453},{"$f":"IF(F1<>\"\",F3/(ABS(ROW(INDIRECT(F1))-ROW(INDIRECT($AG$1)))+ABS(COLUMN(INDIRECT(F1))-COLUMN(INDIRECT($AG$1)))),0)","v":30},33.333333333333336,112.5,null,37.5,33.333333333333336,50,10,11.111111111111111,12.5,14.285714285714286,16.666666666666668,14.285714285714286,12.5,11.111111111111111,{"$f":"IF(U1<>\"\",U3/(ABS(ROW(INDIRECT(U1))-ROW(INDIRECT($I$1)))+ABS(COLUMN(INDIRECT(U1))-COLUMN(INDIRECT($I$1)))),0)","v":10},{"$f":"IF(V1<>\"\",V3/(ABS(ROW(INDIRECT(V1))-ROW(INDIRECT($I$1)))+ABS(COLUMN(INDIRECT(V1))-COLUMN(INDIRECT($I$1)))),0)","v":11.111111111111111},12.5,14.285714285714286,16.666666666666668,14.285714285714286,12.5,11.111111111111111,45.454545454545453,30,33.333333333333336,112.5,null,37.5,33.333333333333336,50]
[null,null,null,"PosFrånMedel",{"$f":"IF(E1<>\"\",20-2*(ABS(ROW(INDIRECT(E1))-medelRadVit)+ABS(COLUMN(INDIRECT(E1))-medelKolVit)),0)","v":12},14,16,18,18,16,14,12,12,14,16,18,18,16,14,12,{"$f":"IF(U1<>\"\",20-2*(ABS(ROW(INDIRECT(U1))-medelRadSvart)+ABS(COLUMN(INDIRECT(U1))-medelKolSvart)),0)","v":12},14,16,18,18,16,14,12,12,14,16,18,18,16,14,12]
[null,null,null,"PosFrånMotståndaresMedel",{"$f":"IF(E1<>\"\",2*(ABS(ROW(INDIRECT(E1))-medelRadSvart)+ABS(COLUMN(INDIRECT(E1))-medelKolSvart)),0)","v":20},18,16,14,14,16,18,20,18,16,14,12,12,14,16,18,{"$f":"IF(U1<>\"\",2*(ABS(ROW(INDIRECT(U1))-medelRadVit)+ABS(COLUMN(INDIRECT(U1))-medelKolVit)),0)","v":18},16,14,12,12,14,16,18,20,18,16,14,14,16,18,20]
[]
[]
[]
[]
[]
[]
[]
[]
[]
[]
[null,"sp","A1",null,{"$f":"VLOOKUP(FALSE,B19:E59,4,FALSE)","v":"A1"},"sp","B1",null,{"$f":"VLOOKUP(FALSE,F19:I59,4,FALSE)","v":"B1"},"sp","C1",null,{"$f":"VLOOKUP(FALSE,J19:M59,4,FALSE)","v":"C1"},"sp","D1",null,{"$f":"VLOOKUP(FALSE,N19:Q59,4,FALSE)","v":"D1"},"sp","E1",null,{"$f":"VLOOKUP(FALSE,R19:U59,4,FALSE)","v":"E1"},"sp","F1",null,{"$f":"VLOOKUP(FALSE,V19:Y59,4,FALSE)","v":"F1"},"sp","G1",null,{"$f":"VLOOKUP(FALSE,Z19:AC59,4,FALSE)","v":"G1"},"sp","H1",null,{"$f":"VLOOKUP(FALSE,AD19:AG59,4,FALSE)","v":"H1"},"sp","A2",null,{"$f":"VLOOKUP(FALSE,AH19:AK59,4,FALSE)","v":"A2"},"sp","B2",null,{"$f":"VLOOKUP(FALSE,AL19:AO59,4,FALSE)","v":"B2"},"sp","C2",null,{"$f":"VLOOKUP(FALSE,AP19:AS59,4,FALSE)","v":"C2"},"sp","D2",null,{"$f":"VLOOKUP(FALSE,AT19:AW59,4,FALSE)","v":"D2"},"sp","E2",null,{"$f":"VLOOKUP(FALSE,AX19:BA59,4,FALSE)","v":"E2"},"sp","F2",null,{"$f":"VLOOKUP(FALSE,BB19:BE59,4,FALSE)","v":"F2"},"sp","G2",null,{"$f":"VLOOKUP(FALSE,BF19:BI59,4,FALSE)","v":"G2"},"sp","H2",null,{"$f":"VLOOKUP(FALSE,BJ19:BM59,4,FALSE)","v":"H2"},"sp","A7",null,{"$f":"VLOOKUP(FALSE,BN19:BQ59,4,FALSE)","v":"A7"},"sp","B7",null,{"$f":"VLOOKUP(FALSE,BR19:BU59,4,FALSE)","v":"B7"},"sp","C7",null,{"$f":"VLOOKUP(FALSE,BV19:BY59,4,FALSE)","v":"C7"},"sp","D7",null,{"$f":"VLOOKUP(FALSE,BZ19:CC59,4,FALSE)","v":"D7"},"sp","E7",null,{"$f":"VLOOKUP(FALSE,CD19:CG59,4,FALSE)","v":"E7"},"sp","F7",null,{"$f":"VLOOKUP(FALSE,CH19:CK59,4,FALSE)","v":"F7"},"sp","G7",null,{"$f":"VLOOKUP(FALSE,CL19:CO59,4,FALSE)","v":"G7"},"sp","H7",null,{"$f":"VLOOKUP(FALSE,CP19:CS59,4,FALSE)","v":"H7"},"sp","A8",null,{"$f":"VLOOKUP(FALSE,CT19:CW59,4,FALSE)","v":"A8"},"sp","B8",null,{"$f":"VLOOKUP(FALSE,CX19:DA59,4,FALSE)","v":"B8"},"sp","C8",null,{"$f":"VLOOKUP(FALSE,DB19:DE59,4,FALSE)","v":"C8"},"sp","D8",null,{"$f":"VLOOKUP(FALSE,DF19:DI59,4,FALSE)","v":"D8"},"sp","E8",null,{"$f":"VLOOKUP(FALSE,DJ19:DM59,4,FALSE)","v":"E8"},"sp","F8",null,{"$f":"VLOOKUP(FALSE,DN19:DQ59,4,FALSE)","v":"F8"},"sp","G8",null,{"$f":"VLOOKUP(FALSE,DR19:DU59,4,FALSE)","v":"G8"},"sp","H8",null,{"$f":"VLOOKUP(FALSE,DV19:DY59,4,FALSE)","v":"H8"}]
[null,{"$f":"IFERROR(IF(dragnr*4<=C20,FALSE,TRUE),FALSE)","v":false},"Pos","Från/till",{"$f":"C18","v":"A1"},{"$f":"IFERROR(IF(dragnr*4<=G20,FALSE,TRUE),FALSE)","v":false},"Pos","Från/till",{"$f":"G18","v":"B1"},{"$f":"IFERROR(IF(dragnr*4<=K20,FALSE,TRUE),FALSE)","v":false},"Pos","Från/till",{"$f":"K18","v":"C1"},{"$f":"IFERROR(IF(dragnr*4<=O20,FALSE,TRUE),FALSE)","v":false},"Pos","Från/till",{"$f":"O18","v":"D1"},{"$f":"IFERROR(IF(dragnr*4<=S20,FALSE,TRUE),FALSE)","v":false},"Pos","Från/till",{"$f":"S18","v":"E1"},{"$f":"IFERROR(IF(dragnr*4<=W20,FALSE,TRUE),FALSE)","v":false},"Pos","Från/till",{"$f":"W18","v":"F1"},{"$f":"IFERROR(IF(dragnr*4<=AA20,FALSE,TRUE),FALSE)","v":false},"Pos","Från/till",{"$f":"AA18","v":"G1"},{"$f":"IFERROR(IF(dragnr*4<=AE20,FALSE,TRUE),FALSE)","v":false},"Pos","Från/till",{"$f":"AE18","v":"H1"},{"$f":"IFERROR(IF(dragnr*4<=AI20,FALSE,TRUE),FALSE)","v":false},"Pos","Från/till",{"$f":"AI18","v":"A2"},{"$f":"IFERROR(IF(dragnr*4<=AM20,FALSE,TRUE),FALSE)","v":false},"Pos","Från/till",{"$f":"AM18","v":"B2"},{"$f":"IFERROR(IF(dragnr*4<=AQ20,FALSE,TRUE),FALSE)","v":false},"Pos","Från/till",{"$f":"AQ18","v":"C2"},{"$f":"IFERROR(IF(dragnr*4<=AU20,FALSE,TRUE),FALSE)","v":false},"Pos","Från/till",{"$f":"AU18","v":"D2"},{"$f":"IFERROR(IF(dragnr*4<=AY20,FALSE,TRUE),FALSE)","v":false},"Pos","Från/till",{"$f":"AY18","v":"E2"},{"$f":"IFERROR(IF(dragnr*4<=BC20,FALSE,TRUE),FALSE)","v":false},"Pos","Från/till",{"$f":"BC18","v":"F2"},{"$f":"IFERROR(IF(dragnr*4<=BG20,FALSE,TRUE),FALSE)","v":false},"Pos","Från/till",{"$f":"BG18","v":"G2"},{"$f":"IFERROR(IF(dragnr*4<=BK20,FALSE,TRUE),FALSE)","v":false},"Pos","Från/till",{"$f":"BK18","v":"H2"},{"$f":"IFERROR(IF(dragnr*4<=BO20,FALSE,TRUE),FALSE)","v":false},"Pos","Från/till",{"$f":"BO18","v":"A7"},{"$f":"IFERROR(IF(dragnr*4<=BS20,FALSE,TRUE),FALSE)","v":false},"Pos","Från/till",{"$f":"BS18","v":"B7"},{"$f":"IFERROR(IF(dragnr*4<=BW20,FALSE,TRUE),FALSE)","v":false},"Pos","Från/till",{"$f":"BW18","v":"C7"},{"$f":"IFERROR(IF(dragnr*4<=CA20,FALSE,TRUE),FALSE)","v":false},"Pos","Från/till",{"$f":"CA18","v":"D7"},{"$f":"IFERROR(IF(dragnr*4<=CE20,FALSE,TRUE),FALSE)","v":false},"Pos","Från/till",{"$f":"CE18","v":"E7"},{"$f":"IFERROR(IF(dragnr*4<=CI20,FALSE,TRUE),FALSE)","v":false},"Pos","Från/till",{"$f":"CI18","v":"F7"},{"$f":"IFERROR(IF(dragnr*4<=CM20,FALSE,TRUE),FALSE)","v":false},"Pos","Från/till",{"$f":"CM18","v":"G7"},{"$f":"IFERROR(IF(dragnr*4<=CQ20,FALSE,TRUE),FALSE)","v":false},"Pos","Från/till",{"$f":"CQ18","v":"H7"},{"$f":"IFERROR(IF(dragnr*4<=CU20,FALSE,TRUE),FALSE)","v":false},"Pos","Från/till",{"$f":"CU18","v":"A8"},{"$f":"IFERROR(IF(dragnr*4<=CY20,FALSE,TRUE),FALSE)","v":false},"Pos","Från/till",{"$f":"CY18","v":"B8"},{"$f":"IFERROR(IF(dragnr*4<=DC20,FALSE,TRUE),FALSE)","v":false},"Pos","Från/till",{"$f":"DC18","v":"C8"},{"$f":"IFERROR(IF(dragnr*4<=DG20,FALSE,TRUE),FALSE)","v":false},"Pos","Från/till",{"$f":"DG18","v":"D8"},{"$f":"IFERROR(IF(dragnr*4<=DK20,FALSE,TRUE),FALSE)","v":false},"Pos","Från/till",{"$f":"DK18","v":"E8"},{"$f":"IFERROR(IF(dragnr*4<=DO20,FALSE,TRUE),FALSE)","v":false},"Pos","Från/till",{"$f":"DO18","v":"F8"},{"$f":"IFERROR(IF(dragnr*4<=DS20,FALSE,TRUE),FALSE)","v":false},"Pos","Från/till",{"$f":"DS18","v":"G8"},{"$f":"IFERROR(IF(dragnr*4<=DW20,FALSE,TRUE),FALSE)","v":false},"Pos","Från/till",{"$f":"DW18","v":"H8"}]
[null,false,{"$f":"IF(vRockad1>0,vRockad1,IFERROR(SEARCH(E19,UPPER(RenHistorik),1),\"\"))","v":""},{"$f":"IFERROR(ISEVEN(C20/2),\"\")","v":""},{"$f":"IF(vRockad1>0,\"d1\",IFERROR(IF(D20,MID(RenHistorik,C20+2,2),\"\"),E19))","v":"A1"},false,{"$f":"SEARCH(G18,UPPER(RenHistorik),1)","v":{"$error":"#VALUE!"}},{"$f":"IFERROR(ISEVEN(G20/2),\"\")","v":""},{"$f":"IFERROR(IF(H20,MID(RenHistorik,G20+2,2),\"\"),I19)","v":"B1"},false,{"$f":"SEARCH(K18,UPPER(RenHistorik),1)","v":{"$error":"#VALUE!"}},{"$f":"IFERROR(ISEVEN(K20/2),\"\")","v":""},{"$f":"IFERROR(IF(L20,MID(RenHistorik,K20+2,2),\"\"),M19)","v":"C1"},false,{"$f":"SEARCH(O18,UPPER(RenHistorik),1)","v":{"$error":"#VALUE!"}},{"$f":"IFERROR(ISEVEN(O20/2),\"\")","v":""},{"$f":"IFERROR(IF(P20,MID(RenHistorik,O20+2,2),\"\"),Q19)","v":"D1"},false,{"$f":"IF(vRockad1>0,vRockad1,IF(vRockad2>0,vRockad2,IFERROR(SEARCH(S18,UPPER(RenHistorik),1),\"\")))","v":""},{"$f":"IFERROR(ISEVEN(S20/2),\"\")","v":""},{"$f":"IF(vRockad1>0,\"c1\",IF(vRockad2>0,\"g1\",IFERROR(IF(T20,MID(RenHistorik,S20+2,2),\"\"),U19)))","v":"E1"},false,{"$f":"SEARCH(W18,UPPER(RenHistorik),1)","v":{"$error":"#VALUE!"}},{"$f":"IFERROR(ISEVEN(W20/2),\"\")","v":""},{"$f":"IFERROR(IF(X20,MID(RenHistorik,W20+2,2),\"\"),Y19)","v":"F1"},false,{"$f":"SEARCH(AA18,UPPER(RenHistorik),1)","v":{"$error":"#VALUE!"}},{"$f":"IFERROR(ISEVEN(AA20/2),\"\")","v":""},{"$f":"IFERROR(IF(AB20,MID(RenHistorik,AA20+2,2),\"\"),AC19)","v":"G1"},false,{"$f":"IF(vRockad2>0,vRockad2,IFERROR(SEARCH(AE18,UPPER(RenHistorik),1),\"\"))","v":""},{"$f":"IFERROR(ISEVEN(AE20/2),\"\")","v":""},{"$f":"IF(vRockad2>0,\"f1\",IFERROR(IF(AF20,MID(RenHistorik,AE20+2,2),\"\"),AG19))","v":"H1"},false,{"$f":"IFERROR(SEARCH(AI18,UPPER(RenHistorik),1),\"\")","v":""},{"$f":"IFERROR(ISEVEN(AI20/2),\"\")","v":""},{"$f":"IFERROR(IF(AJ20,MID(RenHistorik,AI20+2,2),\"\"),AK19)","v":"A2"},false,{"$f":"SEARCH(AM18,UPPER(RenHistorik),1)","v":{"$error":"#VALUE!"}},{"$f":"IFERROR(ISEVEN(AM20/2),\"\")","v":""},{"$f":"IFERROR(IF(AN20,MID(RenHistorik,AM20+2,2),\"\"),AO19)","v":"B2"},false,{"$f":"SEARCH(AQ18,UPPER(RenHistorik),1)","v":{"$error":"#VALUE!"}},{"$f":"IFERROR(ISEVEN(AQ20/2),\"\")","v":""},{"$f":"IFERROR(IF(AR20,MID(RenHistorik,AQ20+2,2),\"\"),AS19)","v":"C2"},false,{"$f":"SEARCH(AU18,UPPER(RenHistorik),1)","v":{"$error":"#VALUE!"}},{"$f":"IFERROR(ISEVEN(AU20/2),\"\")","v":""},{"$f":"IFERROR(IF(AV20,MID(RenHistorik,AU20+2,2),\"\"),AW19)","v":"D2"},false,{"$f":"SEARCH(AY18,UPPER(RenHistorik),1)","v":{"$error":"#VALUE!"}},{"$f":"IFERROR(ISEVEN(AY20/2),\"\")","v":""},{"$f":"IFERROR(IF(AZ20,MID(RenHistorik,AY20+2,2),\"\"),BA19)","v":"E2"},false,{"$f":"SEARCH(BC18,UPPER(RenHistorik),1)","v":{"$error":"#VALUE!"}},{"$f":"IFERROR(ISEVEN(BC20/2),\"\")","v":""},{"$f":"IFERROR(IF(BD20,MID(RenHistorik,BC20+2,2),\"\"),BE19)","v":"F2"},false,{"$f":"SEARCH(BG18,UPPER(RenHistorik),1)","v":{"$error":"#VALUE!"}},{"$f":"IFERROR(ISEVEN(BG20/2),\"\")","v":""},{"$f":"IFERROR(IF(BH20,MID(RenHistorik,BG20+2,2),\"\"),BI19)","v":"G2"},false,{"$f":"SEARCH(BK18,UPPER(RenHistorik),1)","v":{"$error":"#VALUE!"}},{"$f":"IFERROR(ISEVEN(BK20/2),\"\")","v":""},{"$f":"IFERROR(IF(BL20,MID(RenHistorik,BK20+2,2),\"\"),BM19)","v":"H2"},false,{"$f":"IFERROR(SEARCH(BO18,UPPER(RenHistorik),1),\"\")","v":""},{"$f":"IFERROR(ISEVEN(BO20/2),\"\")","v":""},{"$f":"IFERROR(IF(BP20,MID(RenHistorik,BO20+2,2),\"\"),BQ19)","v":"A7"},false,{"$f":"SEARCH(BS18,UPPER(RenHistorik),1)","v":{"$error":"#VALUE!"}},{"$f":"IFERROR(ISEVEN(BS20/2),\"\")","v":""},{"$f":"IFERROR(IF(BT20,MID(RenHistorik,BS20+2,2),\"\"),BU19)","v":"B7"},false,{"$f":"SEARCH(BW18,UPPER(RenHistorik),1)","v":{"$error":"#VALUE!"}},{"$f":"IFERROR(ISEVEN(BW20/2),\"\")","v":""},{"$f":"IFERROR(IF(BX20,MID(RenHistorik,BW20+2,2),\"\"),BY19)","v":"C7"},false,{"$f":"SEARCH(CA18,UPPER(RenHistorik),1)","v":{"$error":"#VALUE!"}},{"$f":"IFERROR(ISEVEN(CA20/2),\"\")","v":""},{"$f":"IFERROR(IF(CB20,MID(RenHistorik,CA20+2,2),\"\"),CC19)","v":"D7"},false,{"$f":"SEARCH(CE18,UPPER(RenHistorik),1)","v":{"$error":"#VALUE!"}},{"$f":"IFERROR(ISEVEN(CE20/2),\"\")","v":""},{"$f":"IFERROR(IF(CF20,MID(RenHistorik,CE20+2,2),\"\"),CG19)","v":"E7"},false,{"$f":"SEARCH(CI18,UPPER(RenHistorik),1)","v":{"$error":"#VALUE!"}},{"$f":"IFERROR(ISEVEN(CI20/2),\"\")","v":""},{"$f":"IFERROR(IF(CJ20,MID(RenHistorik,CI20+2,2),\"\"),CK19)","v":"F7"},false,{"$f":"SEARCH(CM18,UPPER(RenHistorik),1)","v":{"$error":"#VALUE!"}},{"$f":"IFERROR(ISEVEN(CM20/2),\"\")","v":""},{"$f":"IFERROR(IF(CN20,MID(RenHistorik,CM20+2,2),\"\"),CO19)","v":"G7"},false,{"$f":"IFERROR(SEARCH(CQ18,UPPER(RenHistorik),1),\"\")","v":""},{"$f":"IFERROR(ISEVEN(CQ20/2),\"\")","v":""},{"$f":"IFERROR(IF(CR20,MID(RenHistorik,CQ20+2,2),\"\"),CS19)","v":"H7"},false,{"$f":"IF(sRockad1>0,sRockad1,SEARCH(CU18,UPPER(RenHistorik),1))","v":{"$error":"#VALUE!"}},{"$f":"IFERROR(ISEVEN(CU20/2),\"\")","v":""},{"$f":"IF(sRockad1>0,\"d8\",IFERROR(IF(CV20,MID(RenHistorik,CU20+2,2),\"\"),CW19))","v":"A8"},false,{"$f":"SEARCH(CY18,UPPER(RenHistorik),1)","v":{"$error":"#VALUE!"}},{"$f":"IFERROR(ISEVEN(CY20/2),\"\")","v":""},{"$f":"IFERROR(IF(CZ20,MID(RenHistorik,CY20+2,2),\"\"),DA19)","v":"B8"},false,{"$f":"SEARCH(DC18,UPPER(RenHistorik),1)","v":{"$error":"#VALUE!"}},{"$f":"IFERROR(ISEVEN(DC20/2),\"\")","v":""},{"$f":"IFERROR(IF(DD20,MID(RenHistorik,DC20+2,2),\"\"),DE19)","v":"C8"},false,{"$f":"SEARCH(DG18,UPPER(RenHistorik),1)","v":{"$error":"#VALUE!"}},{"$f":"IFERROR(ISEVEN(DG20/2),\"\")","v":""},{"$f":"IFERROR(IF(DH20,MID(RenHistorik,DG20+2,2),\"\"),DI19)","v":"D8"},false,{"$f":"IF(sRockad1>0,sRockad1,IF(sRockad2>0,sRockad2,SEARCH(DK18,UPPER(RenHistorik),1)))","v":{"$error":"#VALUE!"}},{"$f":"IFERROR(ISEVEN(DK20/2),\"\")","v":""},{"$f":"IF(sRockad1>0,\"c8\",IF(sRockad2>0,\"g8\",IFERROR(IF(DL20,MID(RenHistorik,DK20+2,2),\"\"),DM19)))","v":"E8"},false,{"$f":"SEARCH(DO18,UPPER(RenHistorik),1)","v":{"$error":"#VALUE!"}},{"$f":"IFERROR(ISEVEN(DO20/2),\"\")","v":""},{"$f":"IFERROR(IF(DP20,MID(RenHistorik,DO20+2,2),\"\"),DQ19)","v":"F8"},false,{"$f":"IFERROR(SEARCH(DS18,UPPER(RenHistorik),1),\"\")","v":""},{"$f":"IFERROR(ISEVEN(DS20/2),\"\")","v":""},{"$f":"IFERROR(IF(DT20,MID(RenHistorik,DS20+2,2),\"\"),DU19)","v":"G8"},false,{"$f":"IF(sRockad2>0,sRockad2,SEARCH(DW18,UPPER(RenHistorik),1))","v":{"$error":"#VALUE!"}},{"$f":"IFERROR(ISEVEN(DW20/2),\"\")","v":""},{"$f":"IF(sRockad2>0,\"f8\",IFERROR(IF(DX20,MID(RenHistorik,DW20+2,2),\"\"),DY19))","v":"H8"}]
[null,false,{"$f":"IFERROR(IF(D20,SEARCH(E20,UPPER(RenHistorik),C20+3),\"\"),\"\")","v":""},"",{"$f":"IFERROR(IF(D21,MID(RenHistorik,C21+2,2),\"\"),E20)","v":"A1"},false,{"$f":"IFERROR(IF(H20,SEARCH(I20,UPPER(RenHistorik),G20+3),\"\"),\"\")","v":""},"","B1",false,{"$f":"IFERROR(IF(L20,SEARCH(M20,UPPER(RenHistorik),K20+3),\"\"),\"\")","v":""},"","C1",false,{"$f":"IFERROR(IF(P20,SEARCH(Q20,UPPER(RenHistorik),O20+3),\"\"),\"\")","v":""},"","D1",false,{"$f":"IFERROR(IF(T20,SEARCH(U20,UPPER(RenHistorik),S20+3),\"\"),\"\")","v":""},"",{"$f":"IFERROR(IF(T21,MID(RenHistorik,S21+2,2),\"\"),U20)","v":"E1"},false,{"$f":"IFERROR(IF(X20,SEARCH(Y20,UPPER(RenHistorik),W20+3),\"\"),\"\")","v":""},"","F1",false,{"$f":"IFERROR(IF(AB20,SEARCH(AC20,UPPER(RenHistorik),AA20+3),\"\"),\"\")","v":""},"","G1",false,{"$f":"IFERROR(IF(AF20,SEARCH(AG20,UPPER(RenHistorik),AE20+3),\"\"),\"\")","v":""},"",{"$f":"IFERROR(IF(AF21,MID(RenHistorik,AE21+2,2),\"\"),AG20)","v":"H1"},false,{"$f":"IFERROR(IF(AJ20,SEARCH(AK20,UPPER(RenHistorik),AI20+3),\"\"),\"\")","v":""},{"$f":"IFERROR(ISEVEN(AI21/2),\"\")","v":""},"A2",false,{"$f":"IFERROR(IF(AN20,SEARCH(AO20,UPPER(RenHistorik),AM20+3),\"\"),\"\")","v":""},{"$f":"IFERROR(ISEVEN(AM21/2),\"\")","v":""},"B2",false,{"$f":"IFERROR(IF(AR20,SEARCH(AS20,UPPER(RenHistorik),AQ20+3),\"\"),\"\")","v":""},{"$f":"IFERROR(ISEVEN(AQ21/2),\"\")","v":""},"C2",false,{"$f":"IFERROR(IF(AV20,SEARCH(AW20,UPPER(RenHistorik),AU20+3),\"\"),\"\")","v":""},{"$f":"IFERROR(ISEVEN(AU21/2),\"\")","v":""},"D2",false,{"$f":"IFERROR(IF(AZ20,SEARCH(BA20,UPPER(RenHistorik),AY20+3),\"\"),\"\")","v":""},{"$f":"IFERROR(ISEVEN(AY21/2),\"\")","v":""},"E2",false,{"$f":"IFERROR(IF(BD20,SEARCH(BE20,UPPER(RenHistorik),BC20+3),\"\"),\"\")","v":""},{"$f":"IFERROR(ISEVEN(BC21/2),\"\")","v":""},"F2",false,{"$f":"IFERROR(IF(BH20,SEARCH(BI20,UPPER(RenHistorik),BG20+3),\"\"),\"\")","v":""},{"$f":"IFERROR(ISEVEN(BG21/2),\"\")","v":""},"G2",false,{"$f":"IFERROR(IF(BL20,SEARCH(BM20,UPPER(RenHistorik),BK20+3),\"\"),\"\")","v":""},"","H2",false,{"$f":"IFERROR(IF(BP20,SEARCH(BQ20,UPPER(RenHistorik),BO20+3),\"\"),\"\")","v":""},{"$f":"IFERROR(ISEVEN(BO21/2),\"\")","v":""},"A7",false,{"$f":"IFERROR(IF(BT20,SEARCH(BU20,UPPER(RenHistorik),BS20+3),\"\"),\"\")","v":""},{"$f":"IFERROR(ISEVEN(BS21/2),\"\")","v":""},"B7",false,{"$f":"IFERROR(IF(BX20,SEARCH(BY20,UPPER(RenHistorik),BW20+3),\"\"),\"\")","v":""},{"$f":"IFERROR(ISEVEN(BW21/2),\"\")","v":""},"C7",false,{"$f":"IFERROR(IF(CB20,SEARCH(CC20,UPPER(RenHistorik),CA20+3),\"\"),\"\")","v":""},{"$f":"IFERROR(ISEVEN(CA21/2),\"\")","v":""},"D7",false,{"$f":"IFERROR(IF(CF20,SEARCH(CG20,UPPER(RenHistorik),CE20+3),\"\"),\"\")","v":""},{"$f":"IFERROR(ISEVEN(CE21/2),\"\")","v":""},"E7",false,{"$f":"IFERROR(IF(CJ20,SEARCH(CK20,UPPER(RenHistorik),CI20+3),\"\"),\"\")","v":""},{"$f":"IFERROR(ISEVEN(CI21/2),\"\")","v":""},"F7",false,{"$f":"IFERROR(IF(CN20,SEARCH(CO20,UPPER(RenHistorik),CM20+3),\"\"),\"\")","v":""},{"$f":"IFERROR(ISEVEN(CM21/2),\"\")","v":""},"G7",false,{"$f":"IFERROR(IF(CR20,SEARCH(CS20,UPPER(RenHistorik),CQ20+3),\"\"),\"\")","v":""},{"$f":"IFERROR(ISEVEN(CQ21/2),\"\")","v":""},"H7",false,{"$f":"IFERROR(IF(CV20,SEARCH(CW20,UPPER(RenHistorik),CU20+3),\"\"),\"\")","v":""},{"$f":"IFERROR(ISEVEN(CU21/2),\"\")","v":""},{"$f":"IFERROR(IF(CV21,MID(RenHistorik,CU21+2,2),\"\"),CW20)","v":"A8"},false,{"$f":"IFERROR(IF(CZ20,SEARCH(DA20,UPPER(RenHistorik),CY20+3),\"\"),\"\")","v":""},{"$f":"IFERROR(ISEVEN(CY21/2),\"\")","v":""},"B8",false,{"$f":"IFERROR(IF(DD20,SEARCH(DE20,UPPER(RenHistorik),DC20+3),\"\"),\"\")","v":""},{"$f":"IFERROR(ISEVEN(DC21/2),\"\")","v":""},"C8",false,{"$f":"IFERROR(IF(DH20,SEARCH(DI20,UPPER(RenHistorik),DG20+3),\"\"),\"\")","v":""},{"$f":"IFERROR(ISEVEN(DG21/2),\"\")","v":""},"D8",false,{"$f":"IFERROR(IF(DL20,SEARCH(DM20,UPPER(RenHistorik),DK20+3),\"\"),\"\")","v":""},{"$f":"IFERROR(ISEVEN(DK21/2),\"\")","v":""},{"$f":"IFERROR(IF(DL21,MID(RenHistorik,DK21+2,2),\"\"),DM20)","v":"E8"},false,{"$f":"IFERROR(IF(DP20,SEARCH(DQ20,UPPER(RenHistorik),DO20+3),\"\"),\"\")","v":""},{"$f":"IFERROR(ISEVEN(DO21/2),\"\")","v":""},"F8",false,{"$f":"IFERROR(IF(DT20,SEARCH(DU20,UPPER(RenHistorik),DS20+3),\"\"),\"\")","v":""},{"$f":"IFERROR(ISEVEN(DS21/2),\"\")","v":""},"G8",false,{"$f":"IFERROR(IF(DX20,SEARCH(DY20,UPPER(RenHistorik),DW20+3),\"\"),\"\")","v":""},{"$f":"IFERROR(ISEVEN(DW21/2),\"\")","v":""},{"$f":"IFERROR(IF(DX21,MID(RenHistorik,DW21+2,2),\"\"),DY20)","v":"H8"}]
[null,false,"","","A1",false,{"$f":"IFERROR(IF(H21,SEARCH(I21,UPPER(RenHistorik),G21+3),\"\"),\"\")","v":""},"","B1",false,"","","C1",false,"","","D1",false,"","","E1",false,"","","F1",false,"","","G1",false,"","","H1",false,"",{"$f":"IFERROR(ISEVEN(AI22/2),\"\")","v":""},"A2",false,"",{"$f":"IFERROR(ISEVEN(AM22/2),\"\")","v":""},"B2",false,"",{"$f":"IFERROR(ISEVEN(AQ22/2),\"\")","v":""},"C2",false,"",{"$f":"IFERROR(ISEVEN(AU22/2),\"\")","v":""},"D2",false,"",{"$f":"IFERROR(ISEVEN(AY22/2),\"\")","v":""},"E2",false,"",{"$f":"IFERROR(ISEVEN(BC22/2),\"\")","v":""},"F2",false,"",{"$f":"IFERROR(ISEVEN(BG22/2),\"\")","v":""},"G2",false,"","","H2",false,"",{"$f":"IFERROR(ISEVEN(BO22/2),\"\")","v":""},"A7",false,"",{"$f":"IFERROR(ISEVEN(BS22/2),\"\")","v":""},"B7",false,"",{"$f":"IFERROR(ISEVEN(BW22/2),\"\")","v":""},"C7",false,{"$f":"IFERROR(IF(CB21,SEARCH(CC21,UPPER(RenHistorik),CA21+3),\"\"),\"\")","v":""},{"$f":"IFERROR(ISEVEN(CA22/2),\"\")","v":""},"D7",false,"",{"$f":"IFERROR(ISEVEN(CE22/2),\"\")","v":""},"E7",false,"",{"$f":"IFERROR(ISEVEN(CI22/2),\"\")","v":""},"F7",false,"",{"$f":"IFERROR(ISEVEN(CM22/2),\"\")","v":""},"G7",false,"",{"$f":"IFERROR(ISEVEN(CQ22/2),\"\")","v":""},"H7",false,"",{"$f":"IFERROR(ISEVEN(CU22/2),\"\")","v":""},"A8",false,"",{"$f":"IFERROR(ISEVEN(CY22/2),\"\")","v":""},"B8",false,"",{"$f":"IFERROR(ISEVEN(DC22/2),\"\")","v":""},"C8",false,"",{"$f":"IFERROR(ISEVEN(DG22/2),\"\")","v":""},"D8",false,"",{"$f":"IFERROR(ISEVEN(DK22/2),\"\")","v":""},"E8",false,"",{"$f":"IFERROR(ISEVEN(DO22/2),\"\")","v":""},"F8",false,"",{"$f":"IFERROR(ISEVEN(DS22/2),\"\")","v":""},"G8",false,"",{"$f":"IFERROR(ISEVEN(DW22/2),\"\")","v":""},"H8"]
[null,false,"","","A1",false,"","","B1",false,"","","C1",false,"","","D1",false,"","","E1",false,"","","F1",false,"","","G1",false,"","","H1",false,"",{"$f":"IFERROR(ISEVEN(AI23/2),\"\")","v":""},"A2",false,"",{"$f":"IFERROR(ISEVEN(AM23/2),\"\")","v":""},"B2",false,"",{"$f":"IFERROR(ISEVEN(AQ23/2),\"\")","v":""},"C2",false,"",{"$f":"IFERROR(ISEVEN(AU23/2),\"\")","v":""},"D2",false,"",{"$f":"IFERROR(ISEVEN(AY23/2),\"\")","v":""},"E2",false,"",{"$f":"IFERROR(ISEVEN(BC23/2),\"\")","v":""},"F2",false,"",{"$f":"IFERROR(ISEVEN(BG23/2),\"\")","v":""},"G2",false,"","","H2",false,"",{"$f":"IFERROR(ISEVEN(BO23/2),\"\")","v":""},"A7",false,"",{"$f":"IFERROR(ISEVEN(BS23/2),\"\")","v":""},"B7",false,"",{"$f":"IFERROR(ISEVEN(BW23/2),\"\")","v":""},"C7",false,"",{"$f":"IFERROR(ISEVEN(CA23/2),\"\")","v":""},"D7",false,"",{"$f":"IFERROR(ISEVEN(CE23/2),\"\")","v":""},"E7",false,"",{"$f":"IFERROR(ISEVEN(CI23/2),\"\")","v":""},"F7",false,"",{"$f":"IFERROR(ISEVEN(CM23/2),\"\")","v":""},"G7",false,"",{"$f":"IFERROR(ISEVEN(CQ23/2),\"\")","v":""},"H7",false,"",{"$f":"IFERROR(ISEVEN(CU23/2),\"\")","v":""},"A8",false,"",{"$f":"IFERROR(ISEVEN(CY23/2),\"\")","v":""},"B8",false,"",{"$f":"IFERROR(ISEVEN(DC23/2),\"\")","v":""},"C8",false,"",{"$f":"IFERROR(ISEVEN(DG23/2),\"\")","v":""},"D8",false,"",{"$f":"IFERROR(ISEVEN(DK23/2),\"\")","v":""},"E8",false,"",{"$f":"IFERROR(ISEVEN(DO23/2),\"\")","v":""},"F8",false,"",{"$f":"IFERROR(ISEVEN(DS23/2),\"\")","v":""},"G8",false,"",{"$f":"IFERROR(ISEVEN(DW23/2),\"\")","v":""},"H8"]
[null,false,"","","A1",false,"","","B1",false,"","","C1",false,"","","D1",false,"","","E1",false,"","","F1",false,"","","G1",false,"","","H1",false,"",{"$f":"IFERROR(ISEVEN(AI24/2),\"\")","v":""},"A2",false,"",{"$f":"IFERROR(ISEVEN(AM24/2),\"\")","v":""},"B2",false,"",{"$f":"IFERROR(ISEVEN(AQ24/2),\"\")","v":""},"C2",false,"",{"$f":"IFERROR(ISEVEN(AU24/2),\"\")","v":""},"D2",false,"",{"$f":"IFERROR(ISEVEN(AY24/2),\"\")","v":""},"E2",false,"",{"$f":"IFERROR(ISEVEN(BC24/2),\"\")","v":""},"F2",false,"",{"$f":"IFERROR(ISEVEN(BG24/2),\"\")","v":""},"G2",false,"","","H2",false,"",{"$f":"IFERROR(ISEVEN(BO24/2),\"\")","v":""},"A7",false,"",{"$f":"IFERROR(ISEVEN(BS24/2),\"\")","v":""},"B7",false,"",{"$f":"IFERROR(ISEVEN(BW24/2),\"\")","v":""},"C7",false,"",{"$f":"IFERROR(ISEVEN(CA24/2),\"\")","v":""},"D7",false,"",{"$f":"IFERROR(ISEVEN(CE24/2),\"\")","v":""},"E7",false,"",{"$f":"IFERROR(ISEVEN(CI24/2),\"\")","v":""},"F7",false,"",{"$f":"IFERROR(ISEVEN(CM24/2),\"\")","v":""},"G7",false,"",{"$f":"IFERROR(ISEVEN(CQ24/2),\"\")","v":""},"H7",false,"",{"$f":"IFERROR(ISEVEN(CU24/2),\"\")","v":""},"A8",false,"",{"$f":"IFERROR(ISEVEN(CY24/2),\"\")","v":""},"B8",false,"",{"$f":"IFERROR(ISEVEN(DC24/2),\"\")","v":""},"C8",false,"",{"$f":"IFERROR(ISEVEN(DG24/2),\"\")","v":""},"D8",false,"",{"$f":"IFERROR(ISEVEN(DK24/2),\"\")","v":""},"E8",false,"",{"$f":"IFERROR(ISEVEN(DO24/2),\"\")","v":""},"F8",false,"",{"$f":"IFERROR(ISEVEN(DS24/2),\"\")","v":""},"G8",false,"",{"$f":"IFERROR(ISEVEN(DW24/2),\"\")","v":""},"H8"]
[null,false,"","","A1",false,"","","B1",false,"","","C1",false,"","","D1",false,"","","E1",false,"","","F1",false,"","","G1",false,"","","H1",false,"",{"$f":"IFERROR(ISEVEN(AI25/2),\"\")","v":""},"A2",false,"",{"$f":"IFERROR(ISEVEN(AM25/2),\"\")","v":""},"B2",false,"",{"$f":"IFERROR(ISEVEN(AQ25/2),\"\")","v":""},"C2",false,"",{"$f":"IFERROR(ISEVEN(AU25/2),\"\")","v":""},"D2",false,"",{"$f":"IFERROR(ISEVEN(AY25/2),\"\")","v":""},"E2",false,"",{"$f":"IFERROR(ISEVEN(BC25/2),\"\")","v":""},"F2",false,"",{"$f":"IFERROR(ISEVEN(BG25/2),\"\")","v":""},"G2",false,"","","H2",false,"",{"$f":"IFERROR(ISEVEN(BO25/2),\"\")","v":""},"A7",false,"",{"$f":"IFERROR(ISEVEN(BS25/2),\"\")","v":""},"B7",false,"",{"$f":"IFERROR(ISEVEN(BW25/2),\"\")","v":""},"C7",false,"",{"$f":"IFERROR(ISEVEN(CA25/2),\"\")","v":""},"D7",false,"",{"$f":"IFERROR(ISEVEN(CE25/2),\"\")","v":""},"E7",false,"",{"$f":"IFERROR(ISEVEN(CI25/2),\"\")","v":""},"F7",false,"",{"$f":"IFERROR(ISEVEN(CM25/2),\"\")","v":""},"G7",false,"",{"$f":"IFERROR(ISEVEN(CQ25/2),\"\")","v":""},"H7",false,"",{"$f":"IFERROR(ISEVEN(CU25/2),\"\")","v":""},"A8",false,"",{"$f":"IFERROR(ISEVEN(CY25/2),\"\")","v":""},"B8",false,"",{"$f":"IFERROR(ISEVEN(DC25/2),\"\")","v":""},"C8",false,"",{"$f":"IFERROR(ISEVEN(DG25/2),\"\")","v":""},"D8",false,"",{"$f":"IFERROR(ISEVEN(DK25/2),\"\")","v":""},"E8",false,"",{"$f":"IFERROR(ISEVEN(DO25/2),\"\")","v":""},"F8",false,"",{"$f":"IFERROR(ISEVEN(DS25/2),\"\")","v":""},"G8",false,"",{"$f":"IFERROR(ISEVEN(DW25/2),\"\")","v":""},"H8"]
[null,false,"","","A1",false,"","","B1",false,"","","C1",false,"","","D1",false,"","","E1",false,"","","F1",false,"","","G1",false,"","","H1",false,"",{"$f":"IFERROR(ISEVEN(AI26/2),\"\")","v":""},"A2",false,"",{"$f":"IFERROR(ISEVEN(AM26/2),\"\")","v":""},"B2",false,"",{"$f":"IFERROR(ISEVEN(AQ26/2),\"\")","v":""},"C2",false,"",{"$f":"IFERROR(ISEVEN(AU26/2),\"\")","v":""},"D2",false,"",{"$f":"IFERROR(ISEVEN(AY26/2),\"\")","v":""},"E2",false,"",{"$f":"IFERROR(ISEVEN(BC26/2),\"\")","v":""},"F2",false,"",{"$f":"IFERROR(ISEVEN(BG26/2),\"\")","v":""},"G2",false,"","","H2",false,"",{"$f":"IFERROR(ISEVEN(BO26/2),\"\")","v":""},"A7",false,"",{"$f":"IFERROR(ISEVEN(BS26/2),\"\")","v":""},"B7",false,"",{"$f":"IFERROR(ISEVEN(BW26/2),\"\")","v":""},"C7",false,"",{"$f":"IFERROR(ISEVEN(CA26/2),\"\")","v":""},"D7",false,"",{"$f":"IFERROR(ISEVEN(CE26/2),\"\")","v":""},"E7",false,"",{"$f":"IFERROR(ISEVEN(CI26/2),\"\")","v":""},"F7",false,"",{"$f":"IFERROR(ISEVEN(CM26/2),\"\")","v":""},"G7",false,"",{"$f":"IFERROR(ISEVEN(CQ26/2),\"\")","v":""},"H7",false,"",{"$f":"IFERROR(ISEVEN(CU26/2),\"\")","v":""},"A8",false,"",{"$f":"IFERROR(ISEVEN(CY26/2),\"\")","v":""},"B8",false,"",{"$f":"IFERROR(ISEVEN(DC26/2),\"\")","v":""},"C8",false,"",{"$f":"IFERROR(ISEVEN(DG26/2),\"\")","v":""},"D8",false,"",{"$f":"IFERROR(ISEVEN(DK26/2),\"\")","v":""},"E8",false,"",{"$f":"IFERROR(ISEVEN(DO26/2),\"\")","v":""},"F8",false,"",{"$f":"IFERROR(ISEVEN(DS26/2),\"\")","v":""},"G8",false,"",{"$f":"IFERROR(ISEVEN(DW26/2),\"\")","v":""},"H8"]
[null,false,"","","A1",false,"","","B1",false,"","","C1",false,"","","D1",false,"","","E1",false,"","","F1",false,"","","G1",false,"","","H1",false,"",{"$f":"IFERROR(ISEVEN(AI27/2),\"\")","v":""},"A2",false,"",{"$f":"IFERROR(ISEVEN(AM27/2),\"\")","v":""},"B2",false,"",{"$f":"IFERROR(ISEVEN(AQ27/2),\"\")","v":""},"C2",false,"",{"$f":"IFERROR(ISEVEN(AU27/2),\"\")","v":""},"D2",false,"",{"$f":"IFERROR(ISEVEN(AY27/2),\"\")","v":""},"E2",false,"",{"$f":"IFERROR(ISEVEN(BC27/2),\"\")","v":""},"F2",false,"",{"$f":"IFERROR(ISEVEN(BG27/2),\"\")","v":""},"G2",false,"","","H2",false,"",{"$f":"IFERROR(ISEVEN(BO27/2),\"\")","v":""},"A7",false,"",{"$f":"IFERROR(ISEVEN(BS27/2),\"\")","v":""},"B7",false,"",{"$f":"IFERROR(ISEVEN(BW27/2),\"\")","v":""},"C7",false,"",{"$f":"IFERROR(ISEVEN(CA27/2),\"\")","v":""},"D7",false,"",{"$f":"IFERROR(ISEVEN(CE27/2),\"\")","v":""},"E7",false,"",{"$f":"IFERROR(ISEVEN(CI27/2),\"\")","v":""},"F7",false,"",{"$f":"IFERROR(ISEVEN(CM27/2),\"\")","v":""},"G7",false,"",{"$f":"IFERROR(ISEVEN(CQ27/2),\"\")","v":""},"H7",false,"",{"$f":"IFERROR(ISEVEN(CU27/2),\"\")","v":""},"A8",false,"",{"$f":"IFERROR(ISEVEN(CY27/2),\"\")","v":""},"B8",false,"",{"$f":"IFERROR(ISEVEN(DC27/2),\"\")","v":""},"C8",false,"",{"$f":"IFERROR(ISEVEN(DG27/2),\"\")","v":""},"D8",false,"",{"$f":"IFERROR(ISEVEN(DK27/2),\"\")","v":""},"E8",false,"",{"$f":"IFERROR(ISEVEN(DO27/2),\"\")","v":""},"F8",false,"",{"$f":"IFERROR(ISEVEN(DS27/2),\"\")","v":""},"G8",false,"",{"$f":"IFERROR(ISEVEN(DW27/2),\"\")","v":""},"H8"]
[null,false,"","","A1",false,"","","B1",false,"","","C1",false,"","","D1",false,"","","E1",false,"","","F1",false,"","","G1",false,"","","H1",false,"",{"$f":"IFERROR(ISEVEN(AI28/2),\"\")","v":""},"A2",false,"",{"$f":"IFERROR(ISEVEN(AM28/2),\"\")","v":""},"B2",false,"",{"$f":"IFERROR(ISEVEN(AQ28/2),\"\")","v":""},"C2",false,"",{"$f":"IFERROR(ISEVEN(AU28/2),\"\")","v":""},"D2",false,"",{"$f":"IFERROR(ISEVEN(AY28/2),\"\")","v":""},"E2",false,"",{"$f":"IFERROR(ISEVEN(BC28/2),\"\")","v":""},"F2",false,"",{"$f":"IFERROR(ISEVEN(BG28/2),\"\")","v":""},"G2",false,"","","H2",false,"",{"$f":"IFERROR(ISEVEN(BO28/2),\"\")","v":""},"A7",false,"",{"$f":"IFERROR(ISEVEN(BS28/2),\"\")","v":""},"B7",false,"",{"$f":"IFERROR(ISEVEN(BW28/2),\"\")","v":""},"C7",false,"",{"$f":"IFERROR(ISEVEN(CA28/2),\"\")","v":""},"D7",false,"",{"$f":"IFERROR(ISEVEN(CE28/2),\"\")","v":""},"E7",false,"",{"$f":"IFERROR(ISEVEN(CI28/2),\"\")","v":""},"F7",false,"",{"$f":"IFERROR(ISEVEN(CM28/2),\"\")","v":""},"G7",false,"",{"$f":"IFERROR(ISEVEN(CQ28/2),\"\")","v":""},"H7",false,"",{"$f":"IFERROR(ISEVEN(CU28/2),\"\")","v":""},"A8",false,"",{"$f":"IFERROR(ISEVEN(CY28/2),\"\")","v":""},"B8",false,"",{"$f":"IFERROR(ISEVEN(DC28/2),\"\")","v":""},"C8",false,"",{"$f":"IFERROR(ISEVEN(DG28/2),\"\")","v":""},"D8",false,"",{"$f":"IFERROR(ISEVEN(DK28/2),\"\")","v":""},"E8",false,"",{"$f":"IFERROR(ISEVEN(DO28/2),\"\")","v":""},"F8",false,"",{"$f":"IFERROR(ISEVEN(DS28/2),\"\")","v":""},"G8",false,"",{"$f":"IFERROR(ISEVEN(DW28/2),\"\")","v":""},"H8"]
[null,false,"","","A1",false,"","","B1",false,"","","C1",false,"","","D1",false,"","","E1",false,"","","F1",false,"","","G1",false,"","","H1",false,"",{"$f":"IFERROR(ISEVEN(AI29/2),\"\")","v":""},"A2",false,"",{"$f":"IFERROR(ISEVEN(AM29/2),\"\")","v":""},"B2",false,"",{"$f":"IFERROR(ISEVEN(AQ29/2),\"\")","v":""},"C2",false,"",{"$f":"IFERROR(ISEVEN(AU29/2),\"\")","v":""},"D2",false,"",{"$f":"IFERROR(ISEVEN(AY29/2),\"\")","v":""},"E2",false,"",{"$f":"IFERROR(ISEVEN(BC29/2),\"\")","v":""},"F2",false,"",{"$f":"IFERROR(ISEVEN(BG29/2),\"\")","v":""},"G2",false,"","","H2",false,"",{"$f":"IFERROR(ISEVEN(BO29/2),\"\")","v":""},"A7",false,"",{"$f":"IFERROR(ISEVEN(BS29/2),\"\")","v":""},"B7",false,"",{"$f":"IFERROR(ISEVEN(BW29/2),\"\")","v":""},"C7",false,"",{"$f":"IFERROR(ISEVEN(CA29/2),\"\")","v":""},"D7",false,"",{"$f":"IFERROR(ISEVEN(CE29/2),\"\")","v":""},"E7",false,"",{"$f":"IFERROR(ISEVEN(CI29/2),\"\")","v":""},"F7",false,"",{"$f":"IFERROR(ISEVEN(CM29/2),\"\")","v":""},"G7",false,"",{"$f":"IFERROR(ISEVEN(CQ29/2),\"\")","v":""},"H7",false,"",{"$f":"IFERROR(ISEVEN(CU29/2),\"\")","v":""},"A8",false,"",{"$f":"IFERROR(ISEVEN(CY29/2),\"\")","v":""},"B8",false,"",{"$f":"IFERROR(ISEVEN(DC29/2),\"\")","v":""},"C8",false,"",{"$f":"IFERROR(ISEVEN(DG29/2),\"\")","v":""},"D8",false,"",{"$f":"IFERROR(ISEVEN(DK29/2),\"\")","v":""},"E8",false,"",{"$f":"IFERROR(ISEVEN(DO29/2),\"\")","v":""},"F8",false,"",{"$f":"IFERROR(ISEVEN(DS29/2),\"\")","v":""},"G8",false,"",{"$f":"IFERROR(ISEVEN(DW29/2),\"\")","v":""},"H8"]
[null,false,"","","A1",false,"","","B1",false,"","","C1",false,"","","D1",false,"","","E1",false,"","","F1",false,"","","G1",false,"","","H1",false,"",{"$f":"IFERROR(ISEVEN(AI30/2),\"\")","v":""},"A2",false,"",{"$f":"IFERROR(ISEVEN(AM30/2),\"\")","v":""},"B2",false,"",{"$f":"IFERROR(ISEVEN(AQ30/2),\"\")","v":""},"C2",false,"",{"$f":"IFERROR(ISEVEN(AU30/2),\"\")","v":""},"D2",false,"",{"$f":"IFERROR(ISEVEN(AY30/2),\"\")","v":""},"E2",false,"",{"$f":"IFERROR(ISEVEN(BC30/2),\"\")","v":""},"F2",false,"",{"$f":"IFERROR(ISEVEN(BG30/2),\"\")","v":""},"G2",false,"","","H2",false,"",{"$f":"IFERROR(ISEVEN(BO30/2),\"\")","v":""},"A7",false,"",{"$f":"IFERROR(ISEVEN(BS30/2),\"\")","v":""},"B7",false,"",{"$f":"IFERROR(ISEVEN(BW30/2),\"\")","v":""},"C7",false,"",{"$f":"IFERROR(ISEVEN(CA30/2),\"\")","v":""},"D7",false,"",{"$f":"IFERROR(ISEVEN(CE30/2),\"\")","v":""},"E7",false,"",{"$f":"IFERROR(ISEVEN(CI30/2),\"\")","v":""},"F7",false,"",{"$f":"IFERROR(ISEVEN(CM30/2),\"\")","v":""},"G7",false,"",{"$f":"IFERROR(ISEVEN(CQ30/2),\"\")","v":""},"H7",false,"",{"$f":"IFERROR(ISEVEN(CU30/2),\"\")","v":""},"A8",false,"",{"$f":"IFERROR(ISEVEN(CY30/2),\"\")","v":""},"B8",false,"",{"$f":"IFERROR(ISEVEN(DC30/2),\"\")","v":""},"C8",false,"",{"$f":"IFERROR(ISEVEN(DG30/2),\"\")","v":""},"D8",false,"",{"$f":"IFERROR(ISEVEN(DK30/2),\"\")","v":""},"E8",false,"",{"$f":"IFERROR(ISEVEN(DO30/2),\"\")","v":""},"F8",false,"",{"$f":"IFERROR(ISEVEN(DS30/2),\"\")","v":""},"G8",false,"",{"$f":"IFERROR(ISEVEN(DW30/2),\"\")","v":""},"H8"]
[null,false,"","","A1",false,"","","B1",false,"","","C1",false,"","","D1",false,"","","E1",false,"","","F1",false,"","","G1",false,"","","H1",false,"",{"$f":"IFERROR(ISEVEN(AI31/2),\"\")","v":""},"A2",false,"",{"$f":"IFERROR(ISEVEN(AM31/2),\"\")","v":""},"B2",false,"",{"$f":"IFERROR(ISEVEN(AQ31/2),\"\")","v":""},"C2",false,"",{"$f":"IFERROR(ISEVEN(AU31/2),\"\")","v":""},"D2",false,"",{"$f":"IFERROR(ISEVEN(AY31/2),\"\")","v":""},"E2",false,"",{"$f":"IFERROR(ISEVEN(BC31/2),\"\")","v":""},"F2",false,"",{"$f":"IFERROR(ISEVEN(BG31/2),\"\")","v":""},"G2",false,"","","H2",false,"",{"$f":"IFERROR(ISEVEN(BO31/2),\"\")","v":""},"A7",false,"",{"$f":"IFERROR(ISEVEN(BS31/2),\"\")","v":""},"B7",false,"",{"$f":"IFERROR(ISEVEN(BW31/2),\"\")","v":""},"C7",false,"",{"$f":"IFERROR(ISEVEN(CA31/2),\"\")","v":""},"D7",false,"",{"$f":"IFERROR(ISEVEN(CE31/2),\"\")","v":""},"E7",false,"",{"$f":"IFERROR(ISEVEN(CI31/2),\"\")","v":""},"F7",false,"",{"$f":"IFERROR(ISEVEN(CM31/2),\"\")","v":""},"G7",false,"",{"$f":"IFERROR(ISEVEN(CQ31/2),\"\")","v":""},"H7",false,"",{"$f":"IFERROR(ISEVEN(CU31/2),\"\")","v":""},"A8",false,"",{"$f":"IFERROR(ISEVEN(CY31/2),\"\")","v":""},"B8",false,"",{"$f":"IFERROR(ISEVEN(DC31/2),\"\")","v":""},"C8",false,"",{"$f":"IFERROR(ISEVEN(DG31/2),\"\")","v":""},"D8",false,"",{"$f":"IFERROR(ISEVEN(DK31/2),\"\")","v":""},"E8",false,"",{"$f":"IFERROR(ISEVEN(DO31/2),\"\")","v":""},"F8",false,"",{"$f":"IFERROR(ISEVEN(DS31/2),\"\")","v":""},"G8",false,"",{"$f":"IFERROR(ISEVEN(DW31/2),\"\")","v":""},"H8"]
[null,false,"",{"$f":"IFERROR(ISEVEN(C32/2),\"\")","v":""},"A1",false,"",{"$f":"IFERROR(ISEVEN(G32/2),\"\")","v":""},"B1",false,"",{"$f":"IFERROR(ISEVEN(K32/2),\"\")","v":""},"C1",false,"",{"$f":"IFERROR(ISEVEN(O32/2),\"\")","v":""},"D1",false,"",{"$f":"IFERROR(ISEVEN(S32/2),\"\")","v":""},"E1",false,"",{"$f":"IFERROR(ISEVEN(W32/2),\"\")","v":""},"F1",false,"",{"$f":"IFERROR(ISEVEN(AA32/2),\"\")","v":""},"G1",false,{"$f":"IFERROR(IF(AF31,SEARCH(AG31,UPPER(RenHistorik),AE31+3),\"\"),\"\")","v":""},{"$f":"IFERROR(ISEVEN(AE32/2),\"\")","v":""},{"$f":"IFERROR(IF(AF32,MID(RenHistorik,AE32+2,2),\"\"),AG31)","v":"H1"},false,"",{"$f":"IFERROR(ISEVEN(AI32/2),\"\")","v":""},"A2",false,"",{"$f":"IFERROR(ISEVEN(AM32/2),\"\")","v":""},"B2",false,"",{"$f":"IFERROR(ISEVEN(AQ32/2),\"\")","v":""},"C2",false,"",{"$f":"IFERROR(ISEVEN(AU32/2),\"\")","v":""},"D2",false,"",{"$f":"IFERROR(ISEVEN(AY32/2),\"\")","v":""},"E2",false,"",{"$f":"IFERROR(ISEVEN(BC32/2),\"\")","v":""},"F2",false,"",{"$f":"IFERROR(ISEVEN(BG32/2),\"\")","v":""},"G2",false,{"$f":"IFERROR(IF(BL31,SEARCH(BM31,UPPER(RenHistorik),BK31+3),\"\"),\"\")","v":""},{"$f":"IFERROR(ISEVEN(BK32/2),\"\")","v":""},{"$f":"IFERROR(IF(BL32,MID(RenHistorik,BK32+2,2),\"\"),BM31)","v":"H2"},false,"",{"$f":"IFERROR(ISEVEN(BO32/2),\"\")","v":""},"A7",false,"",{"$f":"IFERROR(ISEVEN(BS32/2),\"\")","v":""},"B7",false,"",{"$f":"IFERROR(ISEVEN(BW32/2),\"\")","v":""},"C7",false,"",{"$f":"IFERROR(ISEVEN(CA32/2),\"\")","v":""},"D7",false,"",{"$f":"IFERROR(ISEVEN(CE32/2),\"\")","v":""},"E7",false,"",{"$f":"IFERROR(ISEVEN(CI32/2),\"\")","v":""},"F7",false,"",{"$f":"IFERROR(ISEVEN(CM32/2),\"\")","v":""},"G7",false,"",{"$f":"IFERROR(ISEVEN(CQ32/2),\"\")","v":""},"H7",false,"",{"$f":"IFERROR(ISEVEN(CU32/2),\"\")","v":""},"A8",false,"",{"$f":"IFERROR(ISEVEN(CY32/2),\"\")","v":""},"B8",false,"",{"$f":"IFERROR(ISEVEN(DC32/2),\"\")","v":""},"C8",false,"",{"$f":"IFERROR(ISEVEN(DG32/2),\"\")","v":""},"D8",false,"",{"$f":"IFERROR(ISEVEN(DK32/2),\"\")","v":""},"E8",false,"",{"$f":"IFERROR(ISEVEN(DO32/2),\"\")","v":""},"F8",false,"",{"$f":"IFERROR(ISEVEN(DS32/2),\"\")","v":""},"G8",false,"",{"$f":"IFERROR(ISEVEN(DW32/2),\"\")","v":""},"H8"]
[null,false,"","","A1",false,"","","B1",false,"","","C1",false,"","","D1",false,"","","E1",false,"","","F1",false,"","","G1",false,"","","H1",false,"",{"$f":"IFERROR(ISEVEN(AI33/2),\"\")","v":""},"A2",false,"",{"$f":"IFERROR(ISEVEN(AM33/2),\"\")","v":""},"B2",false,"",{"$f":"IFERROR(ISEVEN(AQ33/2),\"\")","v":""},"C2",false,"",{"$f":"IFERROR(ISEVEN(AU33/2),\"\")","v":""},"D2",false,"",{"$f":"IFERROR(ISEVEN(AY33/2),\"\")","v":""},"E2",false,"",{"$f":"IFERROR(ISEVEN(BC33/2),\"\")","v":""},"F2",false,"",{"$f":"IFERROR(ISEVEN(BG33/2),\"\")","v":""},"G2",false,"","","H2",false,"",{"$f":"IFERROR(ISEVEN(BO33/2),\"\")","v":""},"A7",false,"",{"$f":"IFERROR(ISEVEN(BS33/2),\"\")","v":""},"B7",false,"",{"$f":"IFERROR(ISEVEN(BW33/2),\"\")","v":""},"C7",false,"",{"$f":"IFERROR(ISEVEN(CA33/2),\"\")","v":""},"D7",false,"",{"$f":"IFERROR(ISEVEN(CE33/2),\"\")","v":""},"E7",false,"",{"$f":"IFERROR(ISEVEN(CI33/2),\"\")","v":""},"F7",false,"",{"$f":"IFERROR(ISEVEN(CM33/2),\"\")","v":""},"G7",false,"",{"$f":"IFERROR(ISEVEN(CQ33/2),\"\")","v":""},"H7",false,"",{"$f":"IFERROR(ISEVEN(CU33/2),\"\")","v":""},"A8",false,"",{"$f":"IFERROR(ISEVEN(CY33/2),\"\")","v":""},"B8",false,"",{"$f":"IFERROR(ISEVEN(DC33/2),\"\")","v":""},"C8",false,"",{"$f":"IFERROR(ISEVEN(DG33/2),\"\")","v":""},"D8",false,"",{"$f":"IFERROR(ISEVEN(DK33/2),\"\")","v":""},"E8",false,"",{"$f":"IFERROR(ISEVEN(DO33/2),\"\")","v":""},"F8",false,"",{"$f":"IFERROR(ISEVEN(DS33/2),\"\")","v":""},"G8",false,"",{"$f":"IFERROR(ISEVEN(DW33/2),\"\")","v":""},"H8"]
[null,false,"","","A1",false,"","","B1",false,"","","C1",false,"","","D1",false,"","","E1",false,"","","F1",false,"","","G1",false,"","","H1",false,"",{"$f":"IFERROR(ISEVEN(AI34/2),\"\")","v":""},"A2",false,"",{"$f":"IFERROR(ISEVEN(AM34/2),\"\")","v":""},"B2",false,"",{"$f":"IFERROR(ISEVEN(AQ34/2),\"\")","v":""},"C2",false,"",{"$f":"IFERROR(ISEVEN(AU34/2),\"\")","v":""},"D2",false,"",{"$f":"IFERROR(ISEVEN(AY34/2),\"\")","v":""},"E2",false,"",{"$f":"IFERROR(ISEVEN(BC34/2),\"\")","v":""},"F2",false,"",{"$f":"IFERROR(ISEVEN(BG34/2),\"\")","v":""},"G2",false,"","","H2",false,"",{"$f":"IFERROR(ISEVEN(BO34/2),\"\")","v":""},"A7",false,"",{"$f":"IFERROR(ISEVEN(BS34/2),\"\")","v":""},"B7",false,"",{"$f":"IFERROR(ISEVEN(BW34/2),\"\")","v":""},"C7",false,"",{"$f":"IFERROR(ISEVEN(CA34/2),\"\")","v":""},"D7",false,"",{"$f":"IFERROR(ISEVEN(CE34/2),\"\")","v":""},"E7",false,"",{"$f":"IFERROR(ISEVEN(CI34/2),\"\")","v":""},"F7",false,"",{"$f":"IFERROR(ISEVEN(CM34/2),\"\")","v":""},"G7",false,"",{"$f":"IFERROR(ISEVEN(CQ34/2),\"\")","v":""},"H7",false,"",{"$f":"IFERROR(ISEVEN(CU34/2),\"\")","v":""},"A8",false,"",{"$f":"IFERROR(ISEVEN(CY34/2),\"\")","v":""},"B8",false,"",{"$f":"IFERROR(ISEVEN(DC34/2),\"\")","v":""},"C8",false,"",{"$f":"IFERROR(ISEVEN(DG34/2),\"\")","v":""},"D8",false,"",{"$f":"IFERROR(ISEVEN(DK34/2),\"\")","v":""},"E8",false,"",{"$f":"IFERROR(ISEVEN(DO34/2),\"\")","v":""},"F8",false,"",{"$f":"IFERROR(ISEVEN(DS34/2),\"\")","v":""},"G8",false,"",{"$f":"IFERROR(ISEVEN(DW34/2),\"\")","v":""},"H8"]
[null,false,"","","A1",false,"","","B1",false,"","","C1",false,"","","D1",false,"","","E1",false,"","","F1",false,"","","G1",false,"","","H1",false,"",{"$f":"IFERROR(ISEVEN(AI35/2),\"\")","v":""},"A2",false,"",{"$f":"IFERROR(ISEVEN(AM35/2),\"\")","v":""},"B2",false,"",{"$f":"IFERROR(ISEVEN(AQ35/2),\"\")","v":""},"C2",false,"",{"$f":"IFERROR(ISEVEN(AU35/2),\"\")","v":""},"D2",false,"",{"$f":"IFERROR(ISEVEN(AY35/2),\"\")","v":""},"E2",false,"",{"$f":"IFERROR(ISEVEN(BC35/2),\"\")","v":""},"F2",false,"",{"$f":"IFERROR(ISEVEN(BG35/2),\"\")","v":""},"G2",false,"","","H2",false,"",{"$f":"IFERROR(ISEVEN(BO35/2),\"\")","v":""},"A7",false,"",{"$f":"IFERROR(ISEVEN(BS35/2),\"\")","v":""},"B7",false,"",{"$f":"IFERROR(ISEVEN(BW35/2),\"\")","v":""},"C7",false,"",{"$f":"IFERROR(ISEVEN(CA35/2),\"\")","v":""},"D7",false,"",{"$f":"IFERROR(ISEVEN(CE35/2),\"\")","v":""},"E7",false,"",{"$f":"IFERROR(ISEVEN(CI35/2),\"\")","v":""},"F7",false,"",{"$f":"IFERROR(ISEVEN(CM35/2),\"\")","v":""},"G7",false,"",{"$f":"IFERROR(ISEVEN(CQ35/2),\"\")","v":""},"H7",false,"",{"$f":"IFERROR(ISEVEN(CU35/2),\"\")","v":""},"A8",false,"",{"$f":"IFERROR(ISEVEN(CY35/2),\"\")","v":""},"B8",false,"",{"$f":"IFERROR(ISEVEN(DC35/2),\"\")","v":""},"C8",false,"",{"$f":"IFERROR(ISEVEN(DG35/2),\"\")","v":""},"D8",false,"",{"$f":"IFERROR(ISEVEN(DK35/2),\"\")","v":""},"E8",false,"",{"$f":"IFERROR(ISEVEN(DO35/2),\"\")","v":""},"F8",false,"",{"$f":"IFERROR(ISEVEN(DS35/2),\"\")","v":""},"G8",false,"",{"$f":"IFERROR(ISEVEN(DW35/2),\"\")","v":""},"H8"]
[null,false,"","","A1",false,"","","B1",false,"","","C1",false,"","","D1",false,"","","E1",false,"","","F1",false,"","","G1",false,"","","H1",false,"",{"$f":"IFERROR(ISEVEN(AI36/2),\"\")","v":""},"A2",false,"",{"$f":"IFERROR(ISEVEN(AM36/2),\"\")","v":""},"B2",false,"",{"$f":"IFERROR(ISEVEN(AQ36/2),\"\")","v":""},"C2",false,"",{"$f":"IFERROR(ISEVEN(AU36/2),\"\")","v":""},"D2",false,"",{"$f":"IFERROR(ISEVEN(AY36/2),\"\")","v":""},"E2",false,"",{"$f":"IFERROR(ISEVEN(BC36/2),\"\")","v":""},"F2",false,"",{"$f":"IFERROR(ISEVEN(BG36/2),\"\")","v":""},"G2",false,"","","H2",false,"",{"$f":"IFERROR(ISEVEN(BO36/2),\"\")","v":""},"A7",false,"",{"$f":"IFERROR(ISEVEN(BS36/2),\"\")","v":""},"B7",false,"",{"$f":"IFERROR(ISEVEN(BW36/2),\"\")","v":""},"C7",false,"",{"$f":"IFERROR(ISEVEN(CA36/2),\"\")","v":""},"D7",false,"",{"$f":"IFERROR(ISEVEN(CE36/2),\"\")","v":""},"E7",false,"",{"$f":"IFERROR(ISEVEN(CI36/2),\"\")","v":""},"F7",false,"",{"$f":"IFERROR(ISEVEN(CM36/2),\"\")","v":""},"G7",false,"",{"$f":"IFERROR(ISEVEN(CQ36/2),\"\")","v":""},"H7",false,"",{"$f":"IFERROR(ISEVEN(CU36/2),\"\")","v":""},"A8",false,"",{"$f":"IFERROR(ISEVEN(CY36/2),\"\")","v":""},"B8",false,"",{"$f":"IFERROR(ISEVEN(DC36/2),\"\")","v":""},"C8",false,"",{"$f":"IFERROR(ISEVEN(DG36/2),\"\")","v":""},"D8",false,"",{"$f":"IFERROR(ISEVEN(DK36/2),\"\")","v":""},"E8",false,"",{"$f":"IFERROR(ISEVEN(DO36/2),\"\")","v":""},"F8",false,"",{"$f":"IFERROR(ISEVEN(DS36/2),\"\")","v":""},"G8",false,"",{"$f":"IFERROR(ISEVEN(DW36/2),\"\")","v":""},"H8"]
[null,false,"","","A1",false,"","","B1",false,"","","C1",false,"","","D1",false,"","","E1",false,"","","F1",false,"","","G1",false,"","","H1",false,"",{"$f":"IFERROR(ISEVEN(AI37/2),\"\")","v":""},"A2",false,"",{"$f":"IFERROR(ISEVEN(AM37/2),\"\")","v":""},"B2",false,"",{"$f":"IFERROR(ISEVEN(AQ37/2),\"\")","v":""},"C2",false,"",{"$f":"IFERROR(ISEVEN(AU37/2),\"\")","v":""},"D2",false,"",{"$f":"IFERROR(ISEVEN(AY37/2),\"\")","v":""},"E2",false,"",{"$f":"IFERROR(ISEVEN(BC37/2),\"\")","v":""},"F2",false,"",{"$f":"IFERROR(ISEVEN(BG37/2),\"\")","v":""},"G2",false,"","","H2",false,"",{"$f":"IFERROR(ISEVEN(BO37/2),\"\")","v":""},"A7",false,"",{"$f":"IFERROR(ISEVEN(BS37/2),\"\")","v":""},"B7",false,"",{"$f":"IFERROR(ISEVEN(BW37/2),\"\")","v":""},"C7",false,"",{"$f":"IFERROR(ISEVEN(CA37/2),\"\")","v":""},"D7",false,"",{"$f":"IFERROR(ISEVEN(CE37/2),\"\")","v":""},"E7",false,"",{"$f":"IFERROR(ISEVEN(CI37/2),\"\")","v":""},"F7",false,"",{"$f":"IFERROR(ISEVEN(CM37/2),\"\")","v":""},"G7",false,"",{"$f":"IFERROR(ISEVEN(CQ37/2),\"\")","v":""},"H7",false,"",{"$f":"IFERROR(ISEVEN(CU37/2),\"\")","v":""},"A8",false,"",{"$f":"IFERROR(ISEVEN(CY37/2),\"\")","v":""},"B8",false,"",{"$f":"IFERROR(ISEVEN(DC37/2),\"\")","v":""},"C8",false,"",{"$f":"IFERROR(ISEVEN(DG37/2),\"\")","v":""},"D8",false,"",{"$f":"IFERROR(ISEVEN(DK37/2),\"\")","v":""},"E8",false,"",{"$f":"IFERROR(ISEVEN(DO37/2),\"\")","v":""},"F8",false,"",{"$f":"IFERROR(ISEVEN(DS37/2),\"\")","v":""},"G8",false,"",{"$f":"IFERROR(ISEVEN(DW37/2),\"\")","v":""},"H8"]
[null,false,"","","A1",false,"","","B1",false,"","","C1",false,"","","D1",false,"","","E1",false,"","","F1",false,"","","G1",false,"","","H1",false,"",{"$f":"IFERROR(ISEVEN(AI38/2),\"\")","v":""},"A2",false,"",{"$f":"IFERROR(ISEVEN(AM38/2),\"\")","v":""},"B2",false,"",{"$f":"IFERROR(ISEVEN(AQ38/2),\"\")","v":""},"C2",false,"",{"$f":"IFERROR(ISEVEN(AU38/2),\"\")","v":""},"D2",false,"",{"$f":"IFERROR(ISEVEN(AY38/2),\"\")","v":""},"E2",false,"",{"$f":"IFERROR(ISEVEN(BC38/2),\"\")","v":""},"F2",false,"",{"$f":"IFERROR(ISEVEN(BG38/2),\"\")","v":""},"G2",false,"","","H2",false,"",{"$f":"IFERROR(ISEVEN(BO38/2),\"\")","v":""},"A7",false,"",{"$f":"IFERROR(ISEVEN(BS38/2),\"\")","v":""},"B7",false,"",{"$f":"IFERROR(ISEVEN(BW38/2),\"\")","v":""},"C7",false,"",{"$f":"IFERROR(ISEVEN(CA38/2),\"\")","v":""},"D7",false,"",{"$f":"IFERROR(ISEVEN(CE38/2),\"\")","v":""},"E7",false,"",{"$f":"IFERROR(ISEVEN(CI38/2),\"\")","v":""},"F7",false,"",{"$f":"IFERROR(ISEVEN(CM38/2),\"\")","v":""},"G7",false,"",{"$f":"IFERROR(ISEVEN(CQ38/2),\"\")","v":""},"H7",false,"",{"$f":"IFERROR(ISEVEN(CU38/2),\"\")","v":""},"A8",false,"",{"$f":"IFERROR(ISEVEN(CY38/2),\"\")","v":""},"B8",false,"",{"$f":"IFERROR(ISEVEN(DC38/2),\"\")","v":""},"C8",false,"",{"$f":"IFERROR(ISEVEN(DG38/2),\"\")","v":""},"D8",false,"",{"$f":"IFERROR(ISEVEN(DK38/2),\"\")","v":""},"E8",false,"",{"$f":"IFERROR(ISEVEN(DO38/2),\"\")","v":""},"F8",false,"",{"$f":"IFERROR(ISEVEN(DS38/2),\"\")","v":""},"G8",false,"",{"$f":"IFERROR(ISEVEN(DW38/2),\"\")","v":""},"H8"]
[null,false,"","","A1",false,"","","B1",false,"","","C1",false,"","","D1",false,"","","E1",false,"","","F1",false,"","","G1",false,"","","H1",false,"",{"$f":"IFERROR(ISEVEN(AI39/2),\"\")","v":""},"A2",false,"",{"$f":"IFERROR(ISEVEN(AM39/2),\"\")","v":""},"B2",false,"",{"$f":"IFERROR(ISEVEN(AQ39/2),\"\")","v":""},"C2",false,"",{"$f":"IFERROR(ISEVEN(AU39/2),\"\")","v":""},"D2",false,"",{"$f":"IFERROR(ISEVEN(AY39/2),\"\")","v":""},"E2",false,"",{"$f":"IFERROR(ISEVEN(BC39/2),\"\")","v":""},"F2",false,"",{"$f":"IFERROR(ISEVEN(BG39/2),\"\")","v":""},"G2",false,"","","H2",false,"",{"$f":"IFERROR(ISEVEN(BO39/2),\"\")","v":""},"A7",false,"",{"$f":"IFERROR(ISEVEN(BS39/2),\"\")","v":""},"B7",false,"",{"$f":"IFERROR(ISEVEN(BW39/2),\"\")","v":""},"C7",false,"",{"$f":"IFERROR(ISEVEN(CA39/2),\"\")","v":""},"D7",false,"",{"$f":"IFERROR(ISEVEN(CE39/2),\"\")","v":""},"E7",false,"",{"$f":"IFERROR(ISEVEN(CI39/2),\"\")","v":""},"F7",false,"",{"$f":"IFERROR(ISEVEN(CM39/2),\"\")","v":""},"G7",false,"",{"$f":"IFERROR(ISEVEN(CQ39/2),\"\")","v":""},"H7",false,"",{"$f":"IFERROR(ISEVEN(CU39/2),\"\")","v":""},"A8",false,"",{"$f":"IFERROR(ISEVEN(CY39/2),\"\")","v":""},"B8",false,"",{"$f":"IFERROR(ISEVEN(DC39/2),\"\")","v":""},"C8",false,"",{"$f":"IFERROR(ISEVEN(DG39/2),\"\")","v":""},"D8",false,"",{"$f":"IFERROR(ISEVEN(DK39/2),\"\")","v":""},"E8",false,"",{"$f":"IFERROR(ISEVEN(DO39/2),\"\")","v":""},"F8",false,"",{"$f":"IFERROR(ISEVEN(DS39/2),\"\")","v":""},"G8",false,"",{"$f":"IFERROR(ISEVEN(DW39/2),\"\")","v":""},"H8"]
[null,false,"","","A1",false,"","","B1",false,"","","C1",false,"","","D1",false,"","","E1",false,"","","F1",false,"","","G1",false,"","","H1",false,"",{"$f":"IFERROR(ISEVEN(AI40/2),\"\")","v":""},"A2",false,"",{"$f":"IFERROR(ISEVEN(AM40/2),\"\")","v":""},"B2",false,"",{"$f":"IFERROR(ISEVEN(AQ40/2),\"\")","v":""},"C2",false,"",{"$f":"IFERROR(ISEVEN(AU40/2),\"\")","v":""},"D2",false,"",{"$f":"IFERROR(ISEVEN(AY40/2),\"\")","v":""},"E2",false,"",{"$f":"IFERROR(ISEVEN(BC40/2),\"\")","v":""},"F2",false,"",{"$f":"IFERROR(ISEVEN(BG40/2),\"\")","v":""},"G2",false,"","","H2",false,"",{"$f":"IFERROR(ISEVEN(BO40/2),\"\")","v":""},"A7",false,"",{"$f":"IFERROR(ISEVEN(BS40/2),\"\")","v":""},"B7",false,"",{"$f":"IFERROR(ISEVEN(BW40/2),\"\")","v":""},"C7",false,"",{"$f":"IFERROR(ISEVEN(CA40/2),\"\")","v":""},"D7",false,"",{"$f":"IFERROR(ISEVEN(CE40/2),\"\")","v":""},"E7",false,"",{"$f":"IFERROR(ISEVEN(CI40/2),\"\")","v":""},"F7",false,"",{"$f":"IFERROR(ISEVEN(CM40/2),\"\")","v":""},"G7",false,"",{"$f":"IFERROR(ISEVEN(CQ40/2),\"\")","v":""},"H7",false,"",{"$f":"IFERROR(ISEVEN(CU40/2),\"\")","v":""},"A8",false,"",{"$f":"IFERROR(ISEVEN(CY40/2),\"\")","v":""},"B8",false,"",{"$f":"IFERROR(ISEVEN(DC40/2),\"\")","v":""},"C8",false,"",{"$f":"IFERROR(ISEVEN(DG40/2),\"\")","v":""},"D8",false,"",{"$f":"IFERROR(ISEVEN(DK40/2),\"\")","v":""},"E8",false,"",{"$f":"IFERROR(ISEVEN(DO40/2),\"\")","v":""},"F8",false,"",{"$f":"IFERROR(ISEVEN(DS40/2),\"\")","v":""},"G8",false,"",{"$f":"IFERROR(ISEVEN(DW40/2),\"\")","v":""},"H8"]
[null,false,"","","A1",false,"","","B1",false,"","","C1",false,"","","D1",false,"","","E1",false,"","","F1",false,"","","G1",false,"","","H1",false,"",{"$f":"IFERROR(ISEVEN(AI41/2),\"\")","v":""},"A2",false,"",{"$f":"IFERROR(ISEVEN(AM41/2),\"\")","v":""},"B2",false,"",{"$f":"IFERROR(ISEVEN(AQ41/2),\"\")","v":""},"C2",false,"",{"$f":"IFERROR(ISEVEN(AU41/2),\"\")","v":""},"D2",false,"",{"$f":"IFERROR(ISEVEN(AY41/2),\"\")","v":""},"E2",false,"",{"$f":"IFERROR(ISEVEN(BC41/2),\"\")","v":""},"F2",false,"",{"$f":"IFERROR(ISEVEN(BG41/2),\"\")","v":""},"G2",false,"","","H2",false,"",{"$f":"IFERROR(ISEVEN(BO41/2),\"\")","v":""},"A7",false,"",{"$f":"IFERROR(ISEVEN(BS41/2),\"\")","v":""},"B7",false,"",{"$f":"IFERROR(ISEVEN(BW41/2),\"\")","v":""},"C7",false,"",{"$f":"IFERROR(ISEVEN(CA41/2),\"\")","v":""},"D7",false,"",{"$f":"IFERROR(ISEVEN(CE41/2),\"\")","v":""},"E7",false,"",{"$f":"IFERROR(ISEVEN(CI41/2),\"\")","v":""},"F7",false,"",{"$f":"IFERROR(ISEVEN(CM41/2),\"\")","v":""},"G7",false,"",{"$f":"IFERROR(ISEVEN(CQ41/2),\"\")","v":""},"H7",false,"",{"$f":"IFERROR(ISEVEN(CU41/2),\"\")","v":""},"A8",false,"",{"$f":"IFERROR(ISEVEN(CY41/2),\"\")","v":""},"B8",false,"",{"$f":"IFERROR(ISEVEN(DC41/2),\"\")","v":""},"C8",false,"",{"$f":"IFERROR(ISEVEN(DG41/2),\"\")","v":""},"D8",false,"",{"$f":"IFERROR(ISEVEN(DK41/2),\"\")","v":""},"E8",false,"",{"$f":"IFERROR(ISEVEN(DO41/2),\"\")","v":""},"F8",false,"",{"$f":"IFERROR(ISEVEN(DS41/2),\"\")","v":""},"G8",false,"",{"$f":"IFERROR(ISEVEN(DW41/2),\"\")","v":""},"H8"]
[null,false,"","","A1",false,"","","B1",false,"","","C1",false,"","","D1",false,"","","E1",false,"","","F1",false,"","","G1",false,"","","H1",false,"",{"$f":"IFERROR(ISEVEN(AI42/2),\"\")","v":""},"A2",false,"",{"$f":"IFERROR(ISEVEN(AM42/2),\"\")","v":""},"B2",false,"",{"$f":"IFERROR(ISEVEN(AQ42/2),\"\")","v":""},"C2",false,"",{"$f":"IFERROR(ISEVEN(AU42/2),\"\")","v":""},"D2",false,"",{"$f":"IFERROR(ISEVEN(AY42/2),\"\")","v":""},"E2",false,"",{"$f":"IFERROR(ISEVEN(BC42/2),\"\")","v":""},"F2",false,"",{"$f":"IFERROR(ISEVEN(BG42/2),\"\")","v":""},"G2",false,"","","H2",false,"",{"$f":"IFERROR(ISEVEN(BO42/2),\"\")","v":""},"A7",false,"",{"$f":"IFERROR(ISEVEN(BS42/2),\"\")","v":""},"B7",false,"",{"$f":"IFERROR(ISEVEN(BW42/2),\"\")","v":""},"C7",false,"",{"$f":"IFERROR(ISEVEN(CA42/2),\"\")","v":""},"D7",false,"",{"$f":"IFERROR(ISEVEN(CE42/2),\"\")","v":""},"E7",false,"",{"$f":"IFERROR(ISEVEN(CI42/2),\"\")","v":""},"F7",false,"",{"$f":"IFERROR(ISEVEN(CM42/2),\"\")","v":""},"G7",false,"",{"$f":"IFERROR(ISEVEN(CQ42/2),\"\")","v":""},"H7",false,"",{"$f":"IFERROR(ISEVEN(CU42/2),\"\")","v":""},"A8",false,"",{"$f":"IFERROR(ISEVEN(CY42/2),\"\")","v":""},"B8",false,"",{"$f":"IFERROR(ISEVEN(DC42/2),\"\")","v":""},"C8",false,"",{"$f":"IFERROR(ISEVEN(DG42/2),\"\")","v":""},"D8",false,"",{"$f":"IFERROR(ISEVEN(DK42/2),\"\")","v":""},"E8",false,"",{"$f":"IFERROR(ISEVEN(DO42/2),\"\")","v":""},"F8",false,"",{"$f":"IFERROR(ISEVEN(DS42/2),\"\")","v":""},"G8",false,"",{"$f":"IFERROR(ISEVEN(DW42/2),\"\")","v":""},"H8"]
[null,false,"","","A1",false,"","","B1",false,"","","C1",false,"","","D1",false,"","","E1",false,"","","F1",false,"","","G1",false,"","","H1",false,"",{"$f":"IFERROR(ISEVEN(AI43/2),\"\")","v":""},"A2",false,"",{"$f":"IFERROR(ISEVEN(AM43/2),\"\")","v":""},"B2",false,"",{"$f":"IFERROR(ISEVEN(AQ43/2),\"\")","v":""},"C2",false,"",{"$f":"IFERROR(ISEVEN(AU43/2),\"\")","v":""},"D2",false,"",{"$f":"IFERROR(ISEVEN(AY43/2),\"\")","v":""},"E2",false,"",{"$f":"IFERROR(ISEVEN(BC43/2),\"\")","v":""},"F2",false,"",{"$f":"IFERROR(ISEVEN(BG43/2),\"\")","v":""},"G2",false,"","","H2",false,"",{"$f":"IFERROR(ISEVEN(BO43/2),\"\")","v":""},"A7",false,"",{"$f":"IFERROR(ISEVEN(BS43/2),\"\")","v":""},"B7",false,"",{"$f":"IFERROR(ISEVEN(BW43/2),\"\")","v":""},"C7",false,"",{"$f":"IFERROR(ISEVEN(CA43/2),\"\")","v":""},"D7",false,"",{"$f":"IFERROR(ISEVEN(CE43/2),\"\")","v":""},"E7",false,"",{"$f":"IFERROR(ISEVEN(CI43/2),\"\")","v":""},"F7",false,"",{"$f":"IFERROR(ISEVEN(CM43/2),\"\")","v":""},"G7",false,"",{"$f":"IFERROR(ISEVEN(CQ43/2),\"\")","v":""},"H7",false,"",{"$f":"IFERROR(ISEVEN(CU43/2),\"\")","v":""},"A8",false,"",{"$f":"IFERROR(ISEVEN(CY43/2),\"\")","v":""},"B8",false,"",{"$f":"IFERROR(ISEVEN(DC43/2),\"\")","v":""},"C8",false,"",{"$f":"IFERROR(ISEVEN(DG43/2),\"\")","v":""},"D8",false,"",{"$f":"IFERROR(ISEVEN(DK43/2),\"\")","v":""},"E8",false,"",{"$f":"IFERROR(ISEVEN(DO43/2),\"\")","v":""},"F8",false,"",{"$f":"IFERROR(ISEVEN(DS43/2),\"\")","v":""},"G8",false,"",{"$f":"IFERROR(ISEVEN(DW43/2),\"\")","v":""},"H8"]
[null,false,"","","A1",false,"","","B1",false,"","","C1",false,"","","D1",false,"","","E1",false,"","","F1",false,"","","G1",false,"","","H1",false,"",{"$f":"IFERROR(ISEVEN(AI44/2),\"\")","v":""},"A2",false,"",{"$f":"IFERROR(ISEVEN(AM44/2),\"\")","v":""},"B2",false,"",{"$f":"IFERROR(ISEVEN(AQ44/2),\"\")","v":""},"C2",false,"",{"$f":"IFERROR(ISEVEN(AU44/2),\"\")","v":""},"D2",false,"",{"$f":"IFERROR(ISEVEN(AY44/2),\"\")","v":""},"E2",false,"",{"$f":"IFERROR(ISEVEN(BC44/2),\"\")","v":""},"F2",false,"",{"$f":"IFERROR(ISEVEN(BG44/2),\"\")","v":""},"G2",false,"","","H2",false,"",{"$f":"IFERROR(ISEVEN(BO44/2),\"\")","v":""},"A7",false,"",{"$f":"IFERROR(ISEVEN(BS44/2),\"\")","v":""},"B7",false,"",{"$f":"IFERROR(ISEVEN(BW44/2),\"\")","v":""},"C7",false,"",{"$f":"IFERROR(ISEVEN(CA44/2),\"\")","v":""},"D7",false,"",{"$f":"IFERROR(ISEVEN(CE44/2),\"\")","v":""},"E7",false,"",{"$f":"IFERROR(ISEVEN(CI44/2),\"\")","v":""},"F7",false,"",{"$f":"IFERROR(ISEVEN(CM44/2),\"\")","v":""},"G7",false,"",{"$f":"IFERROR(ISEVEN(CQ44/2),\"\")","v":""},"H7",false,"",{"$f":"IFERROR(ISEVEN(CU44/2),\"\")","v":""},"A8",false,"",{"$f":"IFERROR(ISEVEN(CY44/2),\"\")","v":""},"B8",false,"",{"$f":"IFERROR(ISEVEN(DC44/2),\"\")","v":""},"C8",false,"",{"$f":"IFERROR(ISEVEN(DG44/2),\"\")","v":""},"D8",false,"",{"$f":"IFERROR(ISEVEN(DK44/2),\"\")","v":""},"E8",false,"",{"$f":"IFERROR(ISEVEN(DO44/2),\"\")","v":""},"F8",false,"",{"$f":"IFERROR(ISEVEN(DS44/2),\"\")","v":""},"G8",false,"",{"$f":"IFERROR(ISEVEN(DW44/2),\"\")","v":""},"H8"]
[null,false,"","","A1",false,"","","B1",false,"","","C1",false,"","","D1",false,"","","E1",false,"","","F1",false,"","","G1",false,"","","H1",false,"",{"$f":"IFERROR(ISEVEN(AI45/2),\"\")","v":""},"A2",false,"",{"$f":"IFERROR(ISEVEN(AM45/2),\"\")","v":""},"B2",false,"",{"$f":"IFERROR(ISEVEN(AQ45/2),\"\")","v":""},"C2",false,"",{"$f":"IFERROR(ISEVEN(AU45/2),\"\")","v":""},"D2",false,"",{"$f":"IFERROR(ISEVEN(AY45/2),\"\")","v":""},"E2",false,"",{"$f":"IFERROR(ISEVEN(BC45/2),\"\")","v":""},"F2",false,"",{"$f":"IFERROR(ISEVEN(BG45/2),\"\")","v":""},"G2",false,"","","H2",false,"",{"$f":"IFERROR(ISEVEN(BO45/2),\"\")","v":""},"A7",false,"",{"$f":"IFERROR(ISEVEN(BS45/2),\"\")","v":""},"B7",false,"",{"$f":"IFERROR(ISEVEN(BW45/2),\"\")","v":""},"C7",false,"",{"$f":"IFERROR(ISEVEN(CA45/2),\"\")","v":""},"D7",false,"",{"$f":"IFERROR(ISEVEN(CE45/2),\"\")","v":""},"E7",false,"",{"$f":"IFERROR(ISEVEN(CI45/2),\"\")","v":""},"F7",false,"",{"$f":"IFERROR(ISEVEN(CM45/2),\"\")","v":""},"G7",false,"",{"$f":"IFERROR(ISEVEN(CQ45/2),\"\")","v":""},"H7",false,"",{"$f":"IFERROR(ISEVEN(CU45/2),\"\")","v":""},"A8",false,"",{"$f":"IFERROR(ISEVEN(CY45/2),\"\")","v":""},"B8",false,"",{"$f":"IFERROR(ISEVEN(DC45/2),\"\")","v":""},"C8",false,"",{"$f":"IFERROR(ISEVEN(DG45/2),\"\")","v":""},"D8",false,"",{"$f":"IFERROR(ISEVEN(DK45/2),\"\")","v":""},"E8",false,"",{"$f":"IFERROR(ISEVEN(DO45/2),\"\")","v":""},"F8",false,"",{"$f":"IFERROR(ISEVEN(DS45/2),\"\")","v":""},"G8",false,"",{"$f":"IFERROR(ISEVEN(DW45/2),\"\")","v":""},"H8"]
[null,false,"","","A1",false,"","","B1",false,"","","C1",false,"","","D1",false,"","","E1",false,"","","F1",false,"","","G1",false,"","","H1",false,"",{"$f":"IFERROR(ISEVEN(AI46/2),\"\")","v":""},"A2",false,"",{"$f":"IFERROR(ISEVEN(AM46/2),\"\")","v":""},"B2",false,"",{"$f":"IFERROR(ISEVEN(AQ46/2),\"\")","v":""},"C2",false,"",{"$f":"IFERROR(ISEVEN(AU46/2),\"\")","v":""},"D2",false,"",{"$f":"IFERROR(ISEVEN(AY46/2),\"\")","v":""},"E2",false,"",{"$f":"IFERROR(ISEVEN(BC46/2),\"\")","v":""},"F2",false,"",{"$f":"IFERROR(ISEVEN(BG46/2),\"\")","v":""},"G2",false,"","","H2",false,"",{"$f":"IFERROR(ISEVEN(BO46/2),\"\")","v":""},"A7",false,"",{"$f":"IFERROR(ISEVEN(BS46/2),\"\")","v":""},"B7",false,"",{"$f":"IFERROR(ISEVEN(BW46/2),\"\")","v":""},"C7",false,"",{"$f":"IFERROR(ISEVEN(CA46/2),\"\")","v":""},"D7",false,"",{"$f":"IFERROR(ISEVEN(CE46/2),\"\")","v":""},"E7",false,"",{"$f":"IFERROR(ISEVEN(CI46/2),\"\")","v":""},"F7",false,"",{"$f":"IFERROR(ISEVEN(CM46/2),\"\")","v":""},"G7",false,"",{"$f":"IFERROR(ISEVEN(CQ46/2),\"\")","v":""},"H7",false,"",{"$f":"IFERROR(ISEVEN(CU46/2),\"\")","v":""},"A8",false,"",{"$f":"IFERROR(ISEVEN(CY46/2),\"\")","v":""},"B8",false,"",{"$f":"IFERROR(ISEVEN(DC46/2),\"\")","v":""},"C8",false,"",{"$f":"IFERROR(ISEVEN(DG46/2),\"\")","v":""},"D8",false,"",{"$f":"IFERROR(ISEVEN(DK46/2),\"\")","v":""},"E8",false,"",{"$f":"IFERROR(ISEVEN(DO46/2),\"\")","v":""},"F8",false,"",{"$f":"IFERROR(ISEVEN(DS46/2),\"\")","v":""},"G8",false,"",{"$f":"IFERROR(ISEVEN(DW46/2),\"\")","v":""},"H8"]
[null,false,"","","A1",false,"","","B1",false,"","","C1",false,"","","D1",false,"","","E1",false,"","","F1",false,"","","G1",false,"","","H1",false,"",{"$f":"IFERROR(ISEVEN(AI47/2),\"\")","v":""},"A2",false,"",{"$f":"IFERROR(ISEVEN(AM47/2),\"\")","v":""},"B2",false,"",{"$f":"IFERROR(ISEVEN(AQ47/2),\"\")","v":""},"C2",false,"",{"$f":"IFERROR(ISEVEN(AU47/2),\"\")","v":""},"D2",false,"",{"$f":"IFERROR(ISEVEN(AY47/2),\"\")","v":""},"E2",false,"",{"$f":"IFERROR(ISEVEN(BC47/2),\"\")","v":""},"F2",false,"",{"$f":"IFERROR(ISEVEN(BG47/2),\"\")","v":""},"G2",false,"","","H2",false,"",{"$f":"IFERROR(ISEVEN(BO47/2),\"\")","v":""},"A7",false,"",{"$f":"IFERROR(ISEVEN(BS47/2),\"\")","v":""},"B7",false,"",{"$f":"IFERROR(ISEVEN(BW47/2),\"\")","v":""},"C7",false,"",{"$f":"IFERROR(ISEVEN(CA47/2),\"\")","v":""},"D7",false,"",{"$f":"IFERROR(ISEVEN(CE47/2),\"\")","v":""},"E7",false,"",{"$f":"IFERROR(ISEVEN(CI47/2),\"\")","v":""},"F7",false,"",{"$f":"IFERROR(ISEVEN(CM47/2),\"\")","v":""},"G7",false,"",{"$f":"IFERROR(ISEVEN(CQ47/2),\"\")","v":""},"H7",false,"",{"$f":"IFERROR(ISEVEN(CU47/2),\"\")","v":""},"A8",false,"",{"$f":"IFERROR(ISEVEN(CY47/2),\"\")","v":""},"B8",false,"",{"$f":"IFERROR(ISEVEN(DC47/2),\"\")","v":""},"C8",false,"",{"$f":"IFERROR(ISEVEN(DG47/2),\"\")","v":""},"D8",false,"",{"$f":"IFERROR(ISEVEN(DK47/2),\"\")","v":""},"E8",false,"",{"$f":"IFERROR(ISEVEN(DO47/2),\"\")","v":""},"F8",false,"",{"$f":"IFERROR(ISEVEN(DS47/2),\"\")","v":""},"G8",false,"",{"$f":"IFERROR(ISEVEN(DW47/2),\"\")","v":""},"H8"]
[null,false,"","","A1",false,"","","B1",false,"","","C1",false,"","","D1",false,"","","E1",false,"","","F1",false,"","","G1",false,"","","H1",false,"",{"$f":"IFERROR(ISEVEN(AI48/2),\"\")","v":""},"A2",false,"",{"$f":"IFERROR(ISEVEN(AM48/2),\"\")","v":""},"B2",false,"",{"$f":"IFERROR(ISEVEN(AQ48/2),\"\")","v":""},"C2",false,"",{"$f":"IFERROR(ISEVEN(AU48/2),\"\")","v":""},"D2",false,"",{"$f":"IFERROR(ISEVEN(AY48/2),\"\")","v":""},"E2",false,"",{"$f":"IFERROR(ISEVEN(BC48/2),\"\")","v":""},"F2",false,"",{"$f":"IFERROR(ISEVEN(BG48/2),\"\")","v":""},"G2",false,"","","H2",false,"",{"$f":"IFERROR(ISEVEN(BO48/2),\"\")","v":""},"A7",false,"",{"$f":"IFERROR(ISEVEN(BS48/2),\"\")","v":""},"B7",false,"",{"$f":"IFERROR(ISEVEN(BW48/2),\"\")","v":""},"C7",false,"",{"$f":"IFERROR(ISEVEN(CA48/2),\"\")","v":""},"D7",false,"",{"$f":"IFERROR(ISEVEN(CE48/2),\"\")","v":""},"E7",false,"",{"$f":"IFERROR(ISEVEN(CI48/2),\"\")","v":""},"F7",false,"",{"$f":"IFERROR(ISEVEN(CM48/2),\"\")","v":""},"G7",false,"",{"$f":"IFERROR(ISEVEN(CQ48/2),\"\")","v":""},"H7",false,"",{"$f":"IFERROR(ISEVEN(CU48/2),\"\")","v":""},"A8",false,"",{"$f":"IFERROR(ISEVEN(CY48/2),\"\")","v":""},"B8",false,"",{"$f":"IFERROR(ISEVEN(DC48/2),\"\")","v":""},"C8",false,"",{"$f":"IFERROR(ISEVEN(DG48/2),\"\")","v":""},"D8",false,"",{"$f":"IFERROR(ISEVEN(DK48/2),\"\")","v":""},"E8",false,"",{"$f":"IFERROR(ISEVEN(DO48/2),\"\")","v":""},"F8",false,"",{"$f":"IFERROR(ISEVEN(DS48/2),\"\")","v":""},"G8",false,"",{"$f":"IFERROR(ISEVEN(DW48/2),\"\")","v":""},"H8"]
[null,false,"","","A1",false,"","","B1",false,"","","C1",false,"","","D1",false,"","","E1",false,"","","F1",false,"","","G1",false,"","","H1",false,"",{"$f":"IFERROR(ISEVEN(AI49/2),\"\")","v":""},"A2",false,"",{"$f":"IFERROR(ISEVEN(AM49/2),\"\")","v":""},"B2",false,"",{"$f":"IFERROR(ISEVEN(AQ49/2),\"\")","v":""},"C2",false,"",{"$f":"IFERROR(ISEVEN(AU49/2),\"\")","v":""},"D2",false,"",{"$f":"IFERROR(ISEVEN(AY49/2),\"\")","v":""},"E2",false,"",{"$f":"IFERROR(ISEVEN(BC49/2),\"\")","v":""},"F2",false,"",{"$f":"IFERROR(ISEVEN(BG49/2),\"\")","v":""},"G2",false,"","","H2",false,"",{"$f":"IFERROR(ISEVEN(BO49/2),\"\")","v":""},"A7",false,"",{"$f":"IFERROR(ISEVEN(BS49/2),\"\")","v":""},"B7",false,"",{"$f":"IFERROR(ISEVEN(BW49/2),\"\")","v":""},"C7",false,"",{"$f":"IFERROR(ISEVEN(CA49/2),\"\")","v":""},"D7",false,"",{"$f":"IFERROR(ISEVEN(CE49/2),\"\")","v":""},"E7",false,"",{"$f":"IFERROR(ISEVEN(CI49/2),\"\")","v":""},"F7",false,"",{"$f":"IFERROR(ISEVEN(CM49/2),\"\")","v":""},"G7",false,"",{"$f":"IFERROR(ISEVEN(CQ49/2),\"\")","v":""},"H7",false,"",{"$f":"IFERROR(ISEVEN(CU49/2),\"\")","v":""},"A8",false,"",{"$f":"IFERROR(ISEVEN(CY49/2),\"\")","v":""},"B8",false,"",{"$f":"IFERROR(ISEVEN(DC49/2),\"\")","v":""},"C8",false,"",{"$f":"IFERROR(ISEVEN(DG49/2),\"\")","v":""},"D8",false,"",{"$f":"IFERROR(ISEVEN(DK49/2),\"\")","v":""},"E8",false,"",{"$f":"IFERROR(ISEVEN(DO49/2),\"\")","v":""},"F8",false,"",{"$f":"IFERROR(ISEVEN(DS49/2),\"\")","v":""},"G8",false,"",{"$f":"IFERROR(ISEVEN(DW49/2),\"\")","v":""},"H8"]
[null,false,"","","A1",false,"","","B1",false,"","","C1",false,"","","D1",false,"","","E1",false,"","","F1",false,"","","G1",false,"","","H1",false,"",{"$f":"IFERROR(ISEVEN(AI50/2),\"\")","v":""},"A2",false,"",{"$f":"IFERROR(ISEVEN(AM50/2),\"\")","v":""},"B2",false,"",{"$f":"IFERROR(ISEVEN(AQ50/2),\"\")","v":""},"C2",false,"",{"$f":"IFERROR(ISEVEN(AU50/2),\"\")","v":""},"D2",false,"",{"$f":"IFERROR(ISEVEN(AY50/2),\"\")","v":""},"E2",false,"",{"$f":"IFERROR(ISEVEN(BC50/2),\"\")","v":""},"F2",false,"",{"$f":"IFERROR(ISEVEN(BG50/2),\"\")","v":""},"G2",false,"","","H2",false,"",{"$f":"IFERROR(ISEVEN(BO50/2),\"\")","v":""},"A7",false,"",{"$f":"IFERROR(ISEVEN(BS50/2),\"\")","v":""},"B7",false,"",{"$f":"IFERROR(ISEVEN(BW50/2),\"\")","v":""},"C7",false,"",{"$f":"IFERROR(ISEVEN(CA50/2),\"\")","v":""},"D7",false,"",{"$f":"IFERROR(ISEVEN(CE50/2),\"\")","v":""},"E7",false,"",{"$f":"IFERROR(ISEVEN(CI50/2),\"\")","v":""},"F7",false,"",{"$f":"IFERROR(ISEVEN(CM50/2),\"\")","v":""},"G7",false,"",{"$f":"IFERROR(ISEVEN(CQ50/2),\"\")","v":""},"H7",false,"",{"$f":"IFERROR(ISEVEN(CU50/2),\"\")","v":""},"A8",false,"",{"$f":"IFERROR(ISEVEN(CY50/2),\"\")","v":""},"B8",false,"",{"$f":"IFERROR(ISEVEN(DC50/2),\"\")","v":""},"C8",false,"",{"$f":"IFERROR(ISEVEN(DG50/2),\"\")","v":""},"D8",false,"",{"$f":"IFERROR(ISEVEN(DK50/2),\"\")","v":""},"E8",false,"",{"$f":"IFERROR(ISEVEN(DO50/2),\"\")","v":""},"F8",false,"",{"$f":"IFERROR(ISEVEN(DS50/2),\"\")","v":""},"G8",false,"",{"$f":"IFERROR(ISEVEN(DW50/2),\"\")","v":""},"H8"]
[null,false,"","","A1",false,"","","B1",false,"","","C1",false,"","","D1",false,"","","E1",false,"","","F1",false,"","","G1",false,"","","H1",false,"",{"$f":"IFERROR(ISEVEN(AI51/2),\"\")","v":""},"A2",false,"",{"$f":"IFERROR(ISEVEN(AM51/2),\"\")","v":""},"B2",false,"",{"$f":"IFERROR(ISEVEN(AQ51/2),\"\")","v":""},"C2",false,"",{"$f":"IFERROR(ISEVEN(AU51/2),\"\")","v":""},"D2",false,"",{"$f":"IFERROR(ISEVEN(AY51/2),\"\")","v":""},"E2",false,"",{"$f":"IFERROR(ISEVEN(BC51/2),\"\")","v":""},"F2",false,"",{"$f":"IFERROR(ISEVEN(BG51/2),\"\")","v":""},"G2",false,"","","H2",false,"",{"$f":"IFERROR(ISEVEN(BO51/2),\"\")","v":""},"A7",false,"",{"$f":"IFERROR(ISEVEN(BS51/2),\"\")","v":""},"B7",false,"",{"$f":"IFERROR(ISEVEN(BW51/2),\"\")","v":""},"C7",false,"",{"$f":"IFERROR(ISEVEN(CA51/2),\"\")","v":""},"D7",false,"",{"$f":"IFERROR(ISEVEN(CE51/2),\"\")","v":""},"E7",false,"",{"$f":"IFERROR(ISEVEN(CI51/2),\"\")","v":""},"F7",false,"",{"$f":"IFERROR(ISEVEN(CM51/2),\"\")","v":""},"G7",false,"",{"$f":"IFERROR(ISEVEN(CQ51/2),\"\")","v":""},"H7",false,"",{"$f":"IFERROR(ISEVEN(CU51/2),\"\")","v":""},"A8",false,"",{"$f":"IFERROR(ISEVEN(CY51/2),\"\")","v":""},"B8",false,"",{"$f":"IFERROR(ISEVEN(DC51/2),\"\")","v":""},"C8",false,"",{"$f":"IFERROR(ISEVEN(DG51/2),\"\")","v":""},"D8",false,"",{"$f":"IFERROR(ISEVEN(DK51/2),\"\")","v":""},"E8",false,"",{"$f":"IFERROR(ISEVEN(DO51/2),\"\")","v":""},"F8",false,"",{"$f":"IFERROR(ISEVEN(DS51/2),\"\")","v":""},"G8",false,"",{"$f":"IFERROR(ISEVEN(DW51/2),\"\")","v":""},"H8"]
[null,false,"","","A1",false,"","","B1",false,"","","C1",false,"","","D1",false,"","","E1",false,"","","F1",false,"","","G1",false,"","","H1",false,"",{"$f":"IFERROR(ISEVEN(AI52/2),\"\")","v":""},"A2",false,"",{"$f":"IFERROR(ISEVEN(AM52/2),\"\")","v":""},"B2",false,"",{"$f":"IFERROR(ISEVEN(AQ52/2),\"\")","v":""},"C2",false,"",{"$f":"IFERROR(ISEVEN(AU52/2),\"\")","v":""},"D2",false,"",{"$f":"IFERROR(ISEVEN(AY52/2),\"\")","v":""},"E2",false,"",{"$f":"IFERROR(ISEVEN(BC52/2),\"\")","v":""},"F2",false,"",{"$f":"IFERROR(ISEVEN(BG52/2),\"\")","v":""},"G2",false,"","","H2",false,"",{"$f":"IFERROR(ISEVEN(BO52/2),\"\")","v":""},"A7",false,"",{"$f":"IFERROR(ISEVEN(BS52/2),\"\")","v":""},"B7",false,"",{"$f":"IFERROR(ISEVEN(BW52/2),\"\")","v":""},"C7",false,"",{"$f":"IFERROR(ISEVEN(CA52/2),\"\")","v":""},"D7",false,"",{"$f":"IFERROR(ISEVEN(CE52/2),\"\")","v":""},"E7",false,"",{"$f":"IFERROR(ISEVEN(CI52/2),\"\")","v":""},"F7",false,"",{"$f":"IFERROR(ISEVEN(CM52/2),\"\")","v":""},"G7",false,"",{"$f":"IFERROR(ISEVEN(CQ52/2),\"\")","v":""},"H7",false,"",{"$f":"IFERROR(ISEVEN(CU52/2),\"\")","v":""},"A8",false,"",{"$f":"IFERROR(ISEVEN(CY52/2),\"\")","v":""},"B8",false,"",{"$f":"IFERROR(ISEVEN(DC52/2),\"\")","v":""},"C8",false,"",{"$f":"IFERROR(ISEVEN(DG52/2),\"\")","v":""},"D8",false,"",{"$f":"IFERROR(ISEVEN(DK52/2),\"\")","v":""},"E8",false,"",{"$f":"IFERROR(ISEVEN(DO52/2),\"\")","v":""},"F8",false,"",{"$f":"IFERROR(ISEVEN(DS52/2),\"\")","v":""},"G8",false,"",{"$f":"IFERROR(ISEVEN(DW52/2),\"\")","v":""},"H8"]
[null,false,"","","A1",false,"","","B1",false,"","","C1",false,"","","D1",false,"","","E1",false,"","","F1",false,"","","G1",false,"","","H1",false,"",{"$f":"IFERROR(ISEVEN(AI53/2),\"\")","v":""},"A2",false,"",{"$f":"IFERROR(ISEVEN(AM53/2),\"\")","v":""},"B2",false,"",{"$f":"IFERROR(ISEVEN(AQ53/2),\"\")","v":""},"C2",false,"",{"$f":"IFERROR(ISEVEN(AU53/2),\"\")","v":""},"D2",false,"",{"$f":"IFERROR(ISEVEN(AY53/2),\"\")","v":""},"E2",false,"",{"$f":"IFERROR(ISEVEN(BC53/2),\"\")","v":""},"F2",false,"",{"$f":"IFERROR(ISEVEN(BG53/2),\"\")","v":""},"G2",false,"","","H2",false,"",{"$f":"IFERROR(ISEVEN(BO53/2),\"\")","v":""},"A7",false,"",{"$f":"IFERROR(ISEVEN(BS53/2),\"\")","v":""},"B7",false,"",{"$f":"IFERROR(ISEVEN(BW53/2),\"\")","v":""},"C7",false,"",{"$f":"IFERROR(ISEVEN(CA53/2),\"\")","v":""},"D7",false,"",{"$f":"IFERROR(ISEVEN(CE53/2),\"\")","v":""},"E7",false,"",{"$f":"IFERROR(ISEVEN(CI53/2),\"\")","v":""},"F7",false,"",{"$f":"IFERROR(ISEVEN(CM53/2),\"\")","v":""},"G7",false,"",{"$f":"IFERROR(ISEVEN(CQ53/2),\"\")","v":""},"H7",false,"",{"$f":"IFERROR(ISEVEN(CU53/2),\"\")","v":""},"A8",false,"",{"$f":"IFERROR(ISEVEN(CY53/2),\"\")","v":""},"B8",false,"",{"$f":"IFERROR(ISEVEN(DC53/2),\"\")","v":""},"C8",false,"",{"$f":"IFERROR(ISEVEN(DG53/2),\"\")","v":""},"D8",false,"",{"$f":"IFERROR(ISEVEN(DK53/2),\"\")","v":""},"E8",false,"",{"$f":"IFERROR(ISEVEN(DO53/2),\"\")","v":""},"F8",false,"",{"$f":"IFERROR(ISEVEN(DS53/2),\"\")","v":""},"G8",false,"",{"$f":"IFERROR(ISEVEN(DW53/2),\"\")","v":""},"H8"]
[null,false,"","","A1",false,"","","B1",false,"","","C1",false,"","","D1",false,"","","E1",false,"","","F1",false,"","","G1",false,"","","H1",false,"",{"$f":"IFERROR(ISEVEN(AI54/2),\"\")","v":""},"A2",false,"",{"$f":"IFERROR(ISEVEN(AM54/2),\"\")","v":""},"B2",false,"",{"$f":"IFERROR(ISEVEN(AQ54/2),\"\")","v":""},"C2",false,"",{"$f":"IFERROR(ISEVEN(AU54/2),\"\")","v":""},"D2",false,"",{"$f":"IFERROR(ISEVEN(AY54/2),\"\")","v":""},"E2",false,"",{"$f":"IFERROR(ISEVEN(BC54/2),\"\")","v":""},"F2",false,"",{"$f":"IFERROR(ISEVEN(BG54/2),\"\")","v":""},"G2",false,"","","H2",false,"",{"$f":"IFERROR(ISEVEN(BO54/2),\"\")","v":""},"A7",false,"",{"$f":"IFERROR(ISEVEN(BS54/2),\"\")","v":""},"B7",false,"",{"$f":"IFERROR(ISEVEN(BW54/2),\"\")","v":""},"C7",false,"",{"$f":"IFERROR(ISEVEN(CA54/2),\"\")","v":""},"D7",false,"",{"$f":"IFERROR(ISEVEN(CE54/2),\"\")","v":""},"E7",false,"",{"$f":"IFERROR(ISEVEN(CI54/2),\"\")","v":""},"F7",false,"",{"$f":"IFERROR(ISEVEN(CM54/2),\"\")","v":""},"G7",false,"",{"$f":"IFERROR(ISEVEN(CQ54/2),\"\")","v":""},"H7",false,"",{"$f":"IFERROR(ISEVEN(CU54/2),\"\")","v":""},"A8",false,"",{"$f":"IFERROR(ISEVEN(CY54/2),\"\")","v":""},"B8",false,"",{"$f":"IFERROR(ISEVEN(DC54/2),\"\")","v":""},"C8",false,"",{"$f":"IFERROR(ISEVEN(DG54/2),\"\")","v":""},"D8",false,"",{"$f":"IFERROR(ISEVEN(DK54/2),\"\")","v":""},"E8",false,"",{"$f":"IFERROR(ISEVEN(DO54/2),\"\")","v":""},"F8",false,"",{"$f":"IFERROR(ISEVEN(DS54/2),\"\")","v":""},"G8",false,"",{"$f":"IFERROR(ISEVEN(DW54/2),\"\")","v":""},"H8"]
[null,false,"","","A1",false,"","","B1",false,"","","C1",false,"","","D1",false,"","","E1",false,"","","F1",false,"","","G1",false,"","","H1",false,"",{"$f":"IFERROR(ISEVEN(AI55/2),\"\")","v":""},"A2",false,"",{"$f":"IFERROR(ISEVEN(AM55/2),\"\")","v":""},"B2",false,"",{"$f":"IFERROR(ISEVEN(AQ55/2),\"\")","v":""},"C2",false,"",{"$f":"IFERROR(ISEVEN(AU55/2),\"\")","v":""},"D2",false,"",{"$f":"IFERROR(ISEVEN(AY55/2),\"\")","v":""},"E2",false,"",{"$f":"IFERROR(ISEVEN(BC55/2),\"\")","v":""},"F2",false,"",{"$f":"IFERROR(ISEVEN(BG55/2),\"\")","v":""},"G2",false,"","","H2",false,"",{"$f":"IFERROR(ISEVEN(BO55/2),\"\")","v":""},"A7",false,"",{"$f":"IFERROR(ISEVEN(BS55/2),\"\")","v":""},"B7",false,"",{"$f":"IFERROR(ISEVEN(BW55/2),\"\")","v":""},"C7",false,"",{"$f":"IFERROR(ISEVEN(CA55/2),\"\")","v":""},"D7",false,"",{"$f":"IFERROR(ISEVEN(CE55/2),\"\")","v":""},"E7",false,"",{"$f":"IFERROR(ISEVEN(CI55/2),\"\")","v":""},"F7",false,"",{"$f":"IFERROR(ISEVEN(CM55/2),\"\")","v":""},"G7",false,"",{"$f":"IFERROR(ISEVEN(CQ55/2),\"\")","v":""},"H7",false,"",{"$f":"IFERROR(ISEVEN(CU55/2),\"\")","v":""},"A8",false,"",{"$f":"IFERROR(ISEVEN(CY55/2),\"\")","v":""},"B8",false,"",{"$f":"IFERROR(ISEVEN(DC55/2),\"\")","v":""},"C8",false,"",{"$f":"IFERROR(ISEVEN(DG55/2),\"\")","v":""},"D8",false,"",{"$f":"IFERROR(ISEVEN(DK55/2),\"\")","v":""},"E8",false,"",{"$f":"IFERROR(ISEVEN(DO55/2),\"\")","v":""},"F8",false,"",{"$f":"IFERROR(ISEVEN(DS55/2),\"\")","v":""},"G8",false,"",{"$f":"IFERROR(ISEVEN(DW55/2),\"\")","v":""},"H8"]
[null,false,"","","A1",false,"","","B1",false,"","","C1",false,"","","D1",false,"","","E1",false,"","","F1",false,"","","G1",false,"","","H1",false,"",{"$f":"IFERROR(ISEVEN(AI56/2),\"\")","v":""},"A2",false,"",{"$f":"IFERROR(ISEVEN(AM56/2),\"\")","v":""},"B2",false,"",{"$f":"IFERROR(ISEVEN(AQ56/2),\"\")","v":""},"C2",false,"",{"$f":"IFERROR(ISEVEN(AU56/2),\"\")","v":""},"D2",false,"",{"$f":"IFERROR(ISEVEN(AY56/2),\"\")","v":""},"E2",false,"",{"$f":"IFERROR(ISEVEN(BC56/2),\"\")","v":""},"F2",false,"",{"$f":"IFERROR(ISEVEN(BG56/2),\"\")","v":""},"G2",false,"","","H2",false,"",{"$f":"IFERROR(ISEVEN(BO56/2),\"\")","v":""},"A7",false,"",{"$f":"IFERROR(ISEVEN(BS56/2),\"\")","v":""},"B7",false,"",{"$f":"IFERROR(ISEVEN(BW56/2),\"\")","v":""},"C7",false,"",{"$f":"IFERROR(ISEVEN(CA56/2),\"\")","v":""},"D7",false,"",{"$f":"IFERROR(ISEVEN(CE56/2),\"\")","v":""},"E7",false,"",{"$f":"IFERROR(ISEVEN(CI56/2),\"\")","v":""},"F7",false,"",{"$f":"IFERROR(ISEVEN(CM56/2),\"\")","v":""},"G7",false,"",{"$f":"IFERROR(ISEVEN(CQ56/2),\"\")","v":""},"H7",false,"",{"$f":"IFERROR(ISEVEN(CU56/2),\"\")","v":""},"A8",false,"",{"$f":"IFERROR(ISEVEN(CY56/2),\"\")","v":""},"B8",false,"",{"$f":"IFERROR(ISEVEN(DC56/2),\"\")","v":""},"C8",false,"",{"$f":"IFERROR(ISEVEN(DG56/2),\"\")","v":""},"D8",false,"",{"$f":"IFERROR(ISEVEN(DK56/2),\"\")","v":""},"E8",false,"",{"$f":"IFERROR(ISEVEN(DO56/2),\"\")","v":""},"F8",false,"",{"$f":"IFERROR(ISEVEN(DS56/2),\"\")","v":""},"G8",false,"",{"$f":"IFERROR(ISEVEN(DW56/2),\"\")","v":""},"H8"]
[null,false,"","","A1",false,"","","B1",false,"","","C1",false,"","","D1",false,"","","E1",false,"","","F1",false,"","","G1",false,"","","H1",false,"",{"$f":"IFERROR(ISEVEN(AI57/2),\"\")","v":""},"A2",false,"",{"$f":"IFERROR(ISEVEN(AM57/2),\"\")","v":""},"B2",false,"",{"$f":"IFERROR(ISEVEN(AQ57/2),\"\")","v":""},"C2",false,"",{"$f":"IFERROR(ISEVEN(AU57/2),\"\")","v":""},"D2",false,"",{"$f":"IFERROR(ISEVEN(AY57/2),\"\")","v":""},"E2",false,"",{"$f":"IFERROR(ISEVEN(BC57/2),\"\")","v":""},"F2",false,"",{"$f":"IFERROR(ISEVEN(BG57/2),\"\")","v":""},"G2",false,"","","H2",false,"",{"$f":"IFERROR(ISEVEN(BO57/2),\"\")","v":""},"A7",false,"",{"$f":"IFERROR(ISEVEN(BS57/2),\"\")","v":""},"B7",false,"",{"$f":"IFERROR(ISEVEN(BW57/2),\"\")","v":""},"C7",false,"",{"$f":"IFERROR(ISEVEN(CA57/2),\"\")","v":""},"D7",false,"",{"$f":"IFERROR(ISEVEN(CE57/2),\"\")","v":""},"E7",false,"",{"$f":"IFERROR(ISEVEN(CI57/2),\"\")","v":""},"F7",false,"",{"$f":"IFERROR(ISEVEN(CM57/2),\"\")","v":""},"G7",false,"",{"$f":"IFERROR(ISEVEN(CQ57/2),\"\")","v":""},"H7",false,"",{"$f":"IFERROR(ISEVEN(CU57/2),\"\")","v":""},"A8",false,"",{"$f":"IFERROR(ISEVEN(CY57/2),\"\")","v":""},"B8",false,"",{"$f":"IFERROR(ISEVEN(DC57/2),\"\")","v":""},"C8",false,"",{"$f":"IFERROR(ISEVEN(DG57/2),\"\")","v":""},"D8",false,"",{"$f":"IFERROR(ISEVEN(DK57/2),\"\")","v":""},"E8",false,"",{"$f":"IFERROR(ISEVEN(DO57/2),\"\")","v":""},"F8",false,"",{"$f":"IFERROR(ISEVEN(DS57/2),\"\")","v":""},"G8",false,"",{"$f":"IFERROR(ISEVEN(DW57/2),\"\")","v":""},"H8"]
[null,false,"","","A1",false,"","","B1",false,"","","C1",false,"","","D1",false,"","","E1",false,"","","F1",false,"","","G1",false,"","","H1",false,"",{"$f":"IFERROR(ISEVEN(AI58/2),\"\")","v":""},"A2",false,"",{"$f":"IFERROR(ISEVEN(AM58/2),\"\")","v":""},"B2",false,"",{"$f":"IFERROR(ISEVEN(AQ58/2),\"\")","v":""},"C2",false,"",{"$f":"IFERROR(ISEVEN(AU58/2),\"\")","v":""},"D2",false,"",{"$f":"IFERROR(ISEVEN(AY58/2),\"\")","v":""},"E2",false,"",{"$f":"IFERROR(ISEVEN(BC58/2),\"\")","v":""},"F2",false,"",{"$f":"IFERROR(ISEVEN(BG58/2),\"\")","v":""},"G2",false,"","","H2",false,"",{"$f":"IFERROR(ISEVEN(BO58/2),\"\")","v":""},"A7",false,"",{"$f":"IFERROR(ISEVEN(BS58/2),\"\")","v":""},"B7",false,"",{"$f":"IFERROR(ISEVEN(BW58/2),\"\")","v":""},"C7",false,"",{"$f":"IFERROR(ISEVEN(CA58/2),\"\")","v":""},"D7",false,"",{"$f":"IFERROR(ISEVEN(CE58/2),\"\")","v":""},"E7",false,"",{"$f":"IFERROR(ISEVEN(CI58/2),\"\")","v":""},"F7",false,"",{"$f":"IFERROR(ISEVEN(CM58/2),\"\")","v":""},"G7",false,"",{"$f":"IFERROR(ISEVEN(CQ58/2),\"\")","v":""},"H7",false,"",{"$f":"IFERROR(ISEVEN(CU58/2),\"\")","v":""},"A8",false,"",{"$f":"IFERROR(ISEVEN(CY58/2),\"\")","v":""},"B8",false,"",{"$f":"IFERROR(ISEVEN(DC58/2),\"\")","v":""},"C8",false,"",{"$f":"IFERROR(ISEVEN(DG58/2),\"\")","v":""},"D8",false,"",{"$f":"IFERROR(ISEVEN(DK58/2),\"\")","v":""},"E8",false,"",{"$f":"IFERROR(ISEVEN(DO58/2),\"\")","v":""},"F8",false,"",{"$f":"IFERROR(ISEVEN(DS58/2),\"\")","v":""},"G8",false,"",{"$f":"IFERROR(ISEVEN(DW58/2),\"\")","v":""},"H8"]
[null,true,"","","A1",true,"","","B1",true,"","","C1",true,"","","D1",true,"","","E1",true,"","","F1",true,"","","G1",true,"","","H1",true,"",{"$f":"IFERROR(ISEVEN(AI59/2),\"\")","v":""},"A2",true,"",{"$f":"IFERROR(ISEVEN(AM59/2),\"\")","v":""},"B2",true,"",{"$f":"IFERROR(ISEVEN(AQ59/2),\"\")","v":""},"C2",true,"",{"$f":"IFERROR(ISEVEN(AU59/2),\"\")","v":""},"D2",true,"",{"$f":"IFERROR(ISEVEN(AY59/2),\"\")","v":""},"E2",true,"",{"$f":"IFERROR(ISEVEN(BC59/2),\"\")","v":""},"F2",true,"",{"$f":"IFERROR(ISEVEN(BG59/2),\"\")","v":""},"G2",true,"","","H2",true,"",{"$f":"IFERROR(ISEVEN(BO59/2),\"\")","v":""},"A7",true,"",{"$f":"IFERROR(ISEVEN(BS59/2),\"\")","v":""},"B7",true,"",{"$f":"IFERROR(ISEVEN(BW59/2),\"\")","v":""},"C7",true,"",{"$f":"IFERROR(ISEVEN(CA59/2),\"\")","v":""},"D7",true,"",{"$f":"IFERROR(ISEVEN(CE59/2),\"\")","v":""},"E7",true,"",{"$f":"IFERROR(ISEVEN(CI59/2),\"\")","v":""},"F7",true,"",{"$f":"IFERROR(ISEVEN(CM59/2),\"\")","v":""},"G7",true,"",{"$f":"IFERROR(ISEVEN(CQ59/2),\"\")","v":""},"H7",true,"",{"$f":"IFERROR(ISEVEN(CU59/2),\"\")","v":""},"A8",true,"",{"$f":"IFERROR(ISEVEN(CY59/2),\"\")","v":""},"B8",true,"",{"$f":"IFERROR(ISEVEN(DC59/2),\"\")","v":""},"C8",true,"",{"$f":"IFERROR(ISEVEN(DG59/2),\"\")","v":""},"D8",true,"",{"$f":"IFERROR(ISEVEN(DK59/2),\"\")","v":""},"E8",true,"",{"$f":"IFERROR(ISEVEN(DO59/2),\"\")","v":""},"F8",true,"",{"$f":"IFERROR(ISEVEN(DS59/2),\"\")","v":""},"G8",true,"",{"$f":"IFERROR(ISEVEN(DW59/2),\"\")","v":""},"H8"]
[null,null,null,null,null,null,null,null,null,null,null,null,null,null,null,null,null,null,null,null,null,null,null,null,null,null,null,null,null,null,null,null,null,null,null,null,null,null,null,null,null,null,null,null,null,null,null,null,null,null,null,null,null,null,null,null,null,null,null,null,null,null,null,null,null,null,null,null,null,null,null,null,null,null,null,null,null,null,null,"Draget efter?","Flyttat 2?"]
[null,"Rockad",null,null,null,null,null,null,null,null,null,null,null,null,null,null,null,null,null,null,null,null,null,null,null,null,null,null,null,"Rockad",null,null,null,null,null,null,null,null,null,null,null,null,null,null,null,null,null,null,null,null,null,null,null,null,null,null,null,null,null,null,null,null,null,null,null,null,null,null,null,null,null,null,null,null,null,null,null,"En passant pos",{"$f":"IFERROR(IF(CB20,SEARCH(\"d6\",UPPER(RenHistorik),CA20+3),\"\"),\"\")","v":""},{"$f":"IF(CA61-CA20=6,TRUE,FALSE)","v":{"$error":"#VALUE!"}},{"$f":"IF(CC20=\"d5\",TRUE,FALSE)","v":false},null,null,null,null,null,null,null,null,null,null,null,null,null,null,null,null,"Rockad",null,null,null,null,null,null,null,null,null,null,null,null,null,null,null,null,null,null,null,null,null,null,null,null,null,null,null,"Rockad"]
[null,null,{"$f":"IFERROR(SEARCH(\"VOO1\",UPPER(RenHistorik),1),0)","v":0},null,null,null,null,null,null,null,null,null,null,null,null,null,null,null,null,null,null,null,null,null,null,null,null,null,null,null,{"$f":"IFERROR(SEARCH(\"VOO2\",UPPER(RenHistorik),1),0)","v":0},null,null,null,null,null,null,null,null,null,null,null,null,null,null,null,null,null,null,null,null,null,null,null,null,null,null,null,null,null,null,null,null,null,null,null,null,null,null,null,null,null,null,null,null,null,null,null,{"$f":"_xlfn.NUMBERVALUE(IFERROR(IF(CB20,SEARCH(CC20,UPPER(RenHistorik),CA20+3),\"\"),\"\")&IFERROR(IF(AND(CB61,CC61,CA61>0),CA61,\"\"),\"\"))","v":0},null,null,null,null,null,null,null,null,null,null,null,null,null,null,null,null,null,null,null,{"$f":"IFERROR(SEARCH(\"SOO1\",UPPER(RenHistorik),1),0)","v":0},null,null,null,null,null,null,null,null,null,null,null,null,null,null,null,null,null,null,null,null,null,null,null,null,null,null,null,{"$f":"IFERROR(SEARCH(\"SOO2\",UPPER(RenHistorik),1),0)","v":0}]

{"sheet":"Visualisering","index":4,"n_rows":35,"n_cols":46,"rows_kept":35,"cut":false,"hidden":true,"merged":[]}
[]
[]
[null,null,null,null,null,"A","B","C","D","E","F","G","H",null,"A1","B1","C1","D1","E1","F1","G1","H1","A2","B2","C2","D2","E2","F2","G2","H2","A7","B7","C7","D7","E7","F7","G7","H7","A8","B8","C8","D8","E8","F8","G8","H8"]
[null,null,null,null,1,{"$f":"IFERROR(HLOOKUP(F$3&$E4,Placeringar,2,FALSE),\"\")","v":"A1"},"B1","C1","D1","E1","F1","G1","H1",null,"VT","VS","VL","VD","VK","VL","VS","VT","VB","VB","VB","VB","VB","VB","VB","VB","SB","SB","SB","SB","SB","SB","SB","SB","ST","SS","SL","SD","SK","SL","SS","ST"]
[null,null,null,null,2,"A2","B2","C2","D2","E2","F2","G2","H2"]
[null,null,null,null,3,"","","","","","","",""]
[null,null,null,null,4,"","","","","","","",""]
[null,null,null,null,5,"","","","","","","",""]
[null,null,null,null,6,"","","","","","","",""]
[null,null,null,null,7,"A7","B7","C7","D7","E7","F7","G7","H7"]
[null,null,null,null,8,"A8","B8","C8","D8","E8","F8","G8","H8"]
[]
[null,null,null,null,null,{"$f":"F14*F26","v":2},{"$f":"G14*G26","v":4},6,8,10,12,14,16]
[null,null,null,null,{"$f":"SUM(F13:M13)/SUM(F14:M14)","v":4.5},{"$f":"COUNTIF(F18:F25,\"V*\")","v":2},{"$f":"COUNTIF(G18:G25,\"V*\")","v":2},2,2,2,2,2,2]
[null,null,null,null,null,{"$f":"F16*F26","v":2},{"$f":"G16*G26","v":4},6,8,10,12,14,16]
[null,null,null,null,{"$f":"SUM(F15:M15)/SUM(F16:M16)","v":4.5},{"$f":"COUNTIF(F18:F25,\"S*\")","v":2},{"$f":"COUNTIF(G18:G25,\"S*\")","v":2},2,2,2,2,2,2]
[null,null,null,null,null,"A","B","C","D","E","F","G","H",null,{"$f":"IF(Logik!E1=\"\",HLOOKUP(Visualisering!O4,Pjaser,2,FALSE),\"\")","v":""},{"$f":"IF(Logik!F1=\"\",HLOOKUP(Visualisering!P4,Pjaser,2,FALSE),\"\")","v":""},{"$f":"IF(Logik!G1=\"\",HLOOKUP(Visualisering!Q4,Pjaser,2,FALSE),\"\")","v":""},{"$f":"IF(Logik!H1=\"\",HLOOKUP(Visualisering!R4,Pjaser,2,FALSE),\"\")","v":""},{"$f":"IF(Logik!I1=\"\",HLOOKUP(Visualisering!S4,Pjaser,2,FALSE),\"\")","v":""},{"$f":"IF(Logik!J1=\"\",HLOOKUP(Visualisering!T4,Pjaser,2,FALSE),\"\")","v":""},{"$f":"IF(Logik!K1=\"\",HLOOKUP(Visualisering!U4,Pjaser,2,FALSE),\"\")","v":""},{"$f":"IF(Logik!L1=\"\",HLOOKUP(Visualisering!V4,Pjaser,2,FALSE),\"\")","v":""},null,{"$f":"O17&P17&Q17&R17&S17&T17&U17&V17&O18&P18&Q18&R18&S18&T18&U18&V18","v":""}]
[{"$f":"B18*E18","v":8},{"$f":"COUNTIF(F18:M18,\"V*\")","v":8},{"$f":"D18*E18","v":0},{"$f":"COUNTIF(F18:M18,\"S*\")","v":0},1,{"$f":"IFERROR(HLOOKUP(F4,PjasStart,2,FALSE),\"\")","v":"VT"},"VS","VL","VD","VK","VL","VS","VT",null,{"$f":"IF(Logik!M1=\"\",HLOOKUP(Visualisering!W4,Pjaser,2,FALSE),\"\")","v":""},{"$f":"IF(Logik!N1=\"\",HLOOKUP(Visualisering!X4,Pjaser,2,FALSE),\"\")","v":""},{"$f":"IF(Logik!O1=\"\",HLOOKUP(Visualisering!Y4,Pjaser,2,FALSE),\"\")","v":""},{"$f":"IF(Logik!P1=\"\",HLOOKUP(Visualisering!Z4,Pjaser,2,FALSE),\"\")","v":""},{"$f":"IF(Logik!Q1=\"\",HLOOKUP(Visualisering!AA4,Pjaser,2,FALSE),\"\")","v":""},{"$f":"IF(Logik!R1=\"\",HLOOKUP(Visualisering!AB4,Pjaser,2,FALSE),\"\")","v":""},{"$f":"IF(Logik!S1=\"\",HLOOKUP(Visualisering!AC4,Pjaser,2,FALSE),\"\")","v":""},{"$f":"IF(Logik!T1=\"\",HLOOKUP(Visualisering!AD4,Pjaser,2,FALSE),\"\")","v":""}]
[{"$f":"B19*E19","v":16},{"$f":"COUNTIF(F19:M19,\"V*\")","v":8},{"$f":"D19*E19","v":0},{"$f":"COUNTIF(F19:M19,\"S*\")","v":0},2,"VB","VB","VB","VB","VB","VB","VB","VB"]
[0,0,0,0,3,"","","","","","","","",null,{"$f":"IF(Logik!U1=\"\",HLOOKUP(Visualisering!AE4,Pjaser,2,FALSE),\"\")","v":""},{"$f":"IF(Logik!V1=\"\",HLOOKUP(Visualisering!AF4,Pjaser,2,FALSE),\"\")","v":""},{"$f":"IF(Logik!W1=\"\",HLOOKUP(Visualisering!AG4,Pjaser,2,FALSE),\"\")","v":""},{"$f":"IF(Logik!X1=\"\",HLOOKUP(Visualisering!AH4,Pjaser,2,FALSE),\"\")","v":""},{"$f":"IF(Logik!Y1=\"\",HLOOKUP(Visualisering!AI4,Pjaser,2,FALSE),\"\")","v":""},{"$f":"IF(Logik!Z1=\"\",HLOOKUP(Visualisering!AJ4,Pjaser,2,FALSE),\"\")","v":""},{"$f":"IF(Logik!AA1=\"\",HLOOKUP(Visualisering!AK4,Pjaser,2,FALSE),\"\")","v":""},{"$f":"IF(Logik!AB1=\"\",HLOOKUP(Visualisering!AL4,Pjaser,2,FALSE),\"\")","v":""},null,{"$f":"O20&P20&Q20&R20&S20&T20&U20&V20&O21&P21&Q21&R21&S21&T21&U21&V21","v":""}]
[0,0,0,0,4,"","","","","","","","",null,{"$f":"IF(Logik!AC1=\"\",HLOOKUP(Visualisering!AM4,Pjaser,2,FALSE),\"\")","v":""},{"$f":"IF(Logik!AD1=\"\",HLOOKUP(Visualisering!AN4,Pjaser,2,FALSE),\"\")","v":""},{"$f":"IF(Logik!AE1=\"\",HLOOKUP(Visualisering!AO4,Pjaser,2,FALSE),\"\")","v":""},{"$f":"IF(Logik!AF1=\"\",HLOOKUP(Visualisering!AP4,Pjaser,2,FALSE),\"\")","v":""},{"$f":"IF(Logik!AG1=\"\",HLOOKUP(Visualisering!AQ4,Pjaser,2,FALSE),\"\")","v":""},{"$f":"IF(Logik!AH1=\"\",HLOOKUP(Visualisering!AR4,Pjaser,2,FALSE),\"\")","v":""},{"$f":"IF(Logik!AI1=\"\",HLOOKUP(Visualisering!AS4,Pjaser,2,FALSE),\"\")","v":""},{"$f":"IF(Logik!AJ1=\"\",HLOOKUP(Visualisering!AT4,Pjaser,2,FALSE),\"\")","v":""}]
[0,0,0,0,5,"","","","","","","",""]
[0,0,0,0,6,"","","","","","","",""]
[0,0,56,8,7,"SB","SB","SB","SB","SB","SB","SB","SB"]
[0,0,64,8,8,"ST","SS","SL","SD","SK","SL","SS","ST"]
[null,{"$f":"SUM(A18:A25)/SUM(B18:B25)","v":1.5},null,{"$f":"SUM(C18:C25)/SUM(D18:D25)","v":7.5},null,1,2,3,4,5,6,7,8]
[null,null,null,null,null,"A","B","C","D","E","F","G","H",null,"SK","SD","ST","SL","SS","SB","VK","VD","VT","VL","VS","VB"]
[null,null,null,null,1,{"$f":"IFERROR(HLOOKUP(F18,Pjaser,2,FALSE),\"\")","v":"♖"},"♘","♗","♕","♔","♗","♘","♖",null,"♚","♛","♜","♝","♞","♟","♔","♕","♖","♗","♘","♙"]
[null,null,null,null,2,"♙","♙","♙","♙","♙","♙","♙","♙","Värde",20000,900,500,300,300,100,20000,900,500,300,300,100]
[null,null,null,null,3,"","","","","","","","","Försvar",100,900,500,300,300,100,100,900,500,300,300,100]
[null,null,null,null,4,"","","","","","","",""]
[null,null,null,null,5,"","","","","","","",""]
[null,null,null,null,6,"","","","","","","",""]
[null,null,null,null,7,"♟","♟","♟","♟","♟","♟","♟","♟"]
[null,null,null,null,8,"♜","♞","♝","♛","♚","♝","♞","♜"]

{"sheet":"Stat","index":5,"n_rows":38,"n_cols":19,"rows_kept":38,"cut":false,"hidden":true,"merged":[]}
[]
[]
[null,null,"Pjäs","Pos","Poäng","PosPoäng","FörsvarPoäng","Attackpoäng","AttackKung","PosFrånMedel","PosFrånMotståndaresMedel","Möjligheter","MöjlPoä"]
[null,1,"A1",{"$f":"OFFSET(Logik!$D$1,0,Stat!B4)","v":"A1"},{"$f":"OFFSET(Logik!$D$1,2,B4)","v":500},{"$f":"OFFSET(Logik!$D$1,3,B4)","v":6},{"$f":"P_A1!$E$9","v":408},{"$f":"P_A1!$E$10","v":0},{"$f":"Logik!E5","v":45.454545454545453},{"$f":"OFFSET(Logik!$D$1,5,B4)","v":12},{"$f":"OFFSET(Logik!$D$1,6,B4)","v":20},{"$f":"P_A1!$E$14","v":0},{"$f":"L4*E4","v":0}]
[null,2,"B1",{"$f":"OFFSET(Logik!$D$1,0,Stat!B5)","v":"B1"},{"$f":"OFFSET(Logik!$D$1,2,B5)","v":300},{"$f":"OFFSET(Logik!$D$1,3,B5)","v":8},{"$f":"P_B1!$E$9","v":100},{"$f":"P_B1!$E$10","v":0},{"$f":"Logik!F5","v":30},{"$f":"OFFSET(Logik!$D$1,5,B5)","v":14},{"$f":"OFFSET(Logik!$D$1,6,B5)","v":18},{"$f":"P_B1!$E$14","v":2},{"$f":"L5*E5","v":600}]
[null,3,"C1",{"$f":"OFFSET(Logik!$D$1,0,Stat!B6)","v":"C1"},{"$f":"OFFSET(Logik!$D$1,2,B6)","v":300},{"$f":"OFFSET(Logik!$D$1,3,B6)","v":10},{"$f":"P_C1!$E$9","v":200},{"$f":"P_C1!$E$10","v":0},{"$f":"Logik!G5","v":33.333333333333336},{"$f":"OFFSET(Logik!$D$1,5,B6)","v":16},{"$f":"OFFSET(Logik!$D$1,6,B6)","v":16},{"$f":"P_C1!$E$27","v":0},0]
[null,4,"D1",{"$f":"OFFSET(Logik!$D$1,0,Stat!B7)","v":"D1"},{"$f":"OFFSET(Logik!$D$1,2,B7)","v":900},{"$f":"OFFSET(Logik!$D$1,3,B7)","v":12},{"$f":"P_D1!E9","v":742},{"$f":"P_D1!E10","v":0},{"$f":"Logik!H5","v":112.5},{"$f":"OFFSET(Logik!$D$1,5,B7)","v":18},{"$f":"OFFSET(Logik!$D$1,6,B7)","v":14},{"$f":"P_D1!$E$27","v":0},0]
[null,5,"E1",{"$f":"OFFSET(Logik!$D$1,0,Stat!B8)","v":"E1"},{"$f":"OFFSET(Logik!$D$1,2,B8)","v":20000},{"$f":"OFFSET(Logik!$D$1,3,B8)","v":32},null,null,{"$f":"Logik!I5","v":0},{"$f":"OFFSET(Logik!$D$1,5,B8)","v":18},{"$f":"OFFSET(Logik!$D$1,6,B8)","v":14},{"$f":"P_E1!$E$27","v":0},0]
[null,6,"F1",{"$f":"OFFSET(Logik!$D$1,0,Stat!B9)","v":"F1"},{"$f":"OFFSET(Logik!$D$1,2,B9)","v":300},{"$f":"OFFSET(Logik!$D$1,3,B9)","v":10},{"$f":"P_F1!$E$9","v":200},{"$f":"P_F1!$E$10","v":0},{"$f":"Logik!J5","v":37.5},{"$f":"OFFSET(Logik!$D$1,5,B9)","v":16},{"$f":"OFFSET(Logik!$D$1,6,B9)","v":16},{"$f":"P_F1!$E$27","v":0},0]
[null,7,"G1",{"$f":"OFFSET(Logik!$D$1,0,Stat!B10)","v":"G1"},{"$f":"OFFSET(Logik!$D$1,2,B10)","v":300},{"$f":"OFFSET(Logik!$D$1,3,B10)","v":8},{"$f":"P_G1!$E$9","v":100},{"$f":"P_G1!$E$10","v":0},{"$f":"Logik!K5","v":33.333333333333336},{"$f":"OFFSET(Logik!$D$1,5,B10)","v":14},{"$f":"OFFSET(Logik!$D$1,6,B10)","v":18},{"$f":"P_G1!$E$14","v":2},600]
[null,8,"H1",{"$f":"OFFSET(Logik!$D$1,0,Stat!B11)","v":"H1"},{"$f":"OFFSET(Logik!$D$1,2,B11)","v":500},{"$f":"OFFSET(Logik!$D$1,3,B11)","v":6},{"$f":"P_H1!$E$9","v":408},{"$f":"P_H1!$E$10","v":0},{"$f":"Logik!L5","v":50},{"$f":"OFFSET(Logik!$D$1,5,B11)","v":12},{"$f":"OFFSET(Logik!$D$1,6,B11)","v":20},{"$f":"P_H1!$E$14","v":0},0]
[null,9,"A2",{"$f":"OFFSET(Logik!$D$1,0,Stat!B12)","v":"A2"},{"$f":"OFFSET(Logik!$D$1,2,B12)","v":100},{"$f":"OFFSET(Logik!$D$1,3,B12)","v":0},{"$f":"P_A2!$E$9","v":0},{"$f":"P_A2!$E$10","v":0},{"$f":"Logik!M5","v":10},{"$f":"OFFSET(Logik!$D$1,5,B12)","v":12},{"$f":"OFFSET(Logik!$D$1,6,B12)","v":18},{"$f":"P_A2!$E$14","v":2},200]
[null,10,"B2",{"$f":"OFFSET(Logik!$D$1,0,Stat!B13)","v":"B2"},{"$f":"OFFSET(Logik!$D$1,2,B13)","v":100},{"$f":"OFFSET(Logik!$D$1,3,B13)","v":0},{"$f":"P_B2!$E$9","v":0},{"$f":"P_B2!$E$10","v":0},{"$f":"Logik!N5","v":11.111111111111111},{"$f":"OFFSET(Logik!$D$1,5,B13)","v":14},{"$f":"OFFSET(Logik!$D$1,6,B13)","v":16},{"$f":"P_B2!$E$14","v":2},200]
[null,11,"C2",{"$f":"OFFSET(Logik!$D$1,0,Stat!B14)","v":"C2"},{"$f":"OFFSET(Logik!$D$1,2,B14)","v":100},{"$f":"OFFSET(Logik!$D$1,3,B14)","v":0},{"$f":"P_C2!$E$9","v":0},{"$f":"P_C2!$E$10","v":0},{"$f":"Logik!O5","v":12.5},{"$f":"OFFSET(Logik!$D$1,5,B14)","v":16},{"$f":"OFFSET(Logik!$D$1,6,B14)","v":14},{"$f":"P_C2!$E$14","v":2},200]
[null,12,"D2",{"$f":"OFFSET(Logik!$D$1,0,Stat!B15)","v":"D2"},{"$f":"OFFSET(Logik!$D$1,2,B15)","v":100},{"$f":"OFFSET(Logik!$D$1,3,B15)","v":0},{"$f":"P_D2!$E$9","v":0},{"$f":"P_D2!$E$10","v":0},{"$f":"Logik!P5","v":14.285714285714286},{"$f":"OFFSET(Logik!$D$1,5,B15)","v":18},{"$f":"OFFSET(Logik!$D$1,6,B15)","v":12},{"$f":"P_D2!$E$14","v":2},200]
[null,13,"E2",{"$f":"OFFSET(Logik!$D$1,0,Stat!B16)","v":"E2"},{"$f":"OFFSET(Logik!$D$1,2,B16)","v":100},{"$f":"OFFSET(Logik!$D$1,3,B16)","v":0},{"$f":"P_E2!$E$9","v":0},{"$f":"P_E2!$E$10","v":0},{"$f":"Logik!Q5","v":16.666666666666668},{"$f":"OFFSET(Logik!$D$1,5,B16)","v":18},{"$f":"OFFSET(Logik!$D$1,6,B16)","v":12},{"$f":"P_E2!$E$14","v":2},200]
[null,14,"F2",{"$f":"OFFSET(Logik!$D$1,0,Stat!B17)","v":"F2"},{"$f":"OFFSET(Logik!$D$1,2,B17)","v":100},{"$f":"OFFSET(Logik!$D$1,3,B17)","v":0},{"$f":"P_F2!$E$9","v":0},{"$f":"P_F2!$E$10","v":0},{"$f":"Logik!R5","v":14.285714285714286},{"$f":"OFFSET(Logik!$D$1,5,B17)","v":16},{"$f":"OFFSET(Logik!$D$1,6,B17)","v":14},{"$f":"P_F2!$E$14","v":2},200]
[null,15,"G2",{"$f":"OFFSET(Logik!$D$1,0,Stat!B18)","v":"G2"},{"$f":"OFFSET(Logik!$D$1,2,B18)","v":100},{"$f":"OFFSET(Logik!$D$1,3,B18)","v":0},{"$f":"P_G2!$E$9","v":0},{"$f":"P_G2!$E$10","v":0},{"$f":"Logik!S5","v":12.5},{"$f":"OFFSET(Logik!$D$1,5,B18)","v":14},{"$f":"OFFSET(Logik!$D$1,6,B18)","v":16},{"$f":"P_G2!$E$14","v":2},200]
[null,16,"H2",{"$f":"OFFSET(Logik!$D$1,0,Stat!B19)","v":"H2"},{"$f":"OFFSET(Logik!$D$1,2,B19)","v":100},{"$f":"OFFSET(Logik!$D$1,3,B19)","v":0},{"$f":"P_H2!$E$9","v":0},{"$f":"P_H2!$E$10","v":0},{"$f":"Logik!T5","v":11.111111111111111},{"$f":"OFFSET(Logik!$D$1,5,B19)","v":12},{"$f":"OFFSET(Logik!$D$1,6,B19)","v":18},{"$f":"P_H2!$E$14","v":2},200]
[null,17,"A7",{"$f":"OFFSET(Logik!$D$1,0,Stat!B20)","v":"A7"},{"$f":"OFFSET(Logik!$D$1,2,B20)","v":100},{"$f":"OFFSET(Logik!$D$1,3,B20)","v":0},{"$f":"P_A7!$E$9","v":0},{"$f":"P_A7!$E$10","v":0},{"$f":"Logik!U5","v":10},{"$f":"OFFSET(Logik!$D$1,5,B20)","v":12},{"$f":"OFFSET(Logik!$D$1,6,B20)","v":18},{"$f":"P_A7!$E$14","v":2},200]
[null,18,"B7",{"$f":"OFFSET(Logik!$D$1,0,Stat!B21)","v":"B7"},{"$f":"OFFSET(Logik!$D$1,2,B21)","v":100},{"$f":"OFFSET(Logik!$D$1,3,B21)","v":0},{"$f":"P_B7!$E$9","v":0},{"$f":"P_B7!$E$10","v":0},{"$f":"Logik!V5","v":11.111111111111111},{"$f":"OFFSET(Logik!$D$1,5,B21)","v":14},{"$f":"OFFSET(Logik!$D$1,6,B21)","v":16},{"$f":"P_B7!$E$14","v":2},200]
[null,19,"C7",{"$f":"OFFSET(Logik!$D$1,0,Stat!B22)","v":"C7"},{"$f":"OFFSET(Logik!$D$1,2,B22)","v":100},{"$f":"OFFSET(Logik!$D$1,3,B22)","v":0},{"$f":"P_C7!$E$9","v":0},{"$f":"P_C7!$E$10","v":0},{"$f":"Logik!W5","v":12.5},{"$f":"OFFSET(Logik!$D$1,5,B22)","v":16},{"$f":"OFFSET(Logik!$D$1,6,B22)","v":14},{"$f":"P_C7!$E$14","v":2},200]
[null,20,"D7",{"$f":"OFFSET(Logik!$D$1,0,Stat!B23)","v":"D7"},{"$f":"OFFSET(Logik!$D$1,2,B23)","v":100},{"$f":"OFFSET(Logik!$D$1,3,B23)","v":0},{"$f":"P_D7!$E$9","v":0},{"$f":"P_D7!$E$10","v":0},{"$f":"Logik!X5","v":14.285714285714286},{"$f":"OFFSET(Logik!$D$1,5,B23)","v":18},{"$f":"OFFSET(Logik!$D$1,6,B23)","v":12},{"$f":"P_D7!$E$14","v":2},200]
[null,21,"E7",{"$f":"OFFSET(Logik!$D$1,0,Stat!B24)","v":"E7"},{"$f":"OFFSET(Logik!$D$1,2,B24)","v":100},{"$f":"OFFSET(Logik!$D$1,3,B24)","v":0},{"$f":"P_E7!$E$9","v":0},{"$f":"P_E7!$E$10","v":0},{"$f":"Logik!Y5","v":16.666666666666668},{"$f":"OFFSET(Logik!$D$1,5,B24)","v":18},{"$f":"OFFSET(Logik!$D$1,6,B24)","v":12},{"$f":"P_E7!$E$14","v":2},200]
[null,22,"F7",{"$f":"OFFSET(Logik!$D$1,0,Stat!B25)","v":"F7"},{"$f":"OFFSET(Logik!$D$1,2,B25)","v":100},{"$f":"OFFSET(Logik!$D$1,3,B25)","v":0},{"$f":"P_F7!$E$9","v":0},{"$f":"P_F7!$E$10","v":0},{"$f":"Logik!Z5","v":14.285714285714286},{"$f":"OFFSET(Logik!$D$1,5,B25)","v":16},{"$f":"OFFSET(Logik!$D$1,6,B25)","v":14},{"$f":"P_F7!$E$14","v":2},200]
[null,23,"G7",{"$f":"OFFSET(Logik!$D$1,0,Stat!B26)","v":"G7"},{"$f":"OFFSET(Logik!$D$1,2,B26)","v":100},{"$f":"OFFSET(Logik!$D$1,3,B26)","v":0},{"$f":"P_G7!$E$9","v":0},{"$f":"P_G7!$E$10","v":0},{"$f":"Logik!AA5","v":12.5},{"$f":"OFFSET(Logik!$D$1,5,B26)","v":14},{"$f":"OFFSET(Logik!$D$1,6,B26)","v":16},{"$f":"P_G7!$E$14","v":2},200]
[null,24,"H7",{"$f":"OFFSET(Logik!$D$1,0,Stat!B27)","v":"H7"},{"$f":"OFFSET(Logik!$D$1,2,B27)","v":100},{"$f":"OFFSET(Logik!$D$1,3,B27)","v":0},{"$f":"P_H7!$E$9","v":0},{"$f":"P_H7!$E$10","v":0},{"$f":"Logik!AB5","v":11.111111111111111},{"$f":"OFFSET(Logik!$D$1,5,B27)","v":12},{"$f":"OFFSET(Logik!$D$1,6,B27)","v":18},{"$f":"P_H7!$E$14","v":2},200]
[null,25,"A8",{"$f":"OFFSET(Logik!$D$1,0,Stat!B28)","v":"A8"},{"$f":"OFFSET(Logik!$D$1,2,B28)","v":500},{"$f":"OFFSET(Logik!$D$1,3,B28)","v":6},{"$f":"P_A8!$E$9","v":408},{"$f":"P_A8!$E$10","v":0},{"$f":"Logik!AC5","v":45.454545454545453},{"$f":"OFFSET(Logik!$D$1,5,B28)","v":12},{"$f":"OFFSET(Logik!$D$1,6,B28)","v":20},{"$f":"P_A8!$E$14","v":0},0]
[null,26,"B8",{"$f":"OFFSET(Logik!$D$1,0,Stat!B29)","v":"B8"},{"$f":"OFFSET(Logik!$D$1,2,B29)","v":300},{"$f":"OFFSET(Logik!$D$1,3,B29)","v":8},{"$f":"P_B8!$E$9","v":100},{"$f":"P_B8!$E$10","v":0},{"$f":"Logik!AD5","v":30},{"$f":"OFFSET(Logik!$D$1,5,B29)","v":14},{"$f":"OFFSET(Logik!$D$1,6,B29)","v":18},{"$f":"P_B8!$E$14","v":2},600]
[null,27,"C8",{"$f":"OFFSET(Logik!$D$1,0,Stat!B30)","v":"C8"},{"$f":"OFFSET(Logik!$D$1,2,B30)","v":300},{"$f":"OFFSET(Logik!$D$1,3,B30)","v":10},{"$f":"P_C8!$E$9","v":200},{"$f":"P_C8!$E$10","v":0},{"$f":"Logik!AE5","v":33.333333333333336},{"$f":"OFFSET(Logik!$D$1,5,B30)","v":16},{"$f":"OFFSET(Logik!$D$1,6,B30)","v":16},{"$f":"P_C8!$E$27","v":0},0]
[null,28,"D8",{"$f":"OFFSET(Logik!$D$1,0,Stat!B31)","v":"D8"},{"$f":"OFFSET(Logik!$D$1,2,B31)","v":900},{"$f":"OFFSET(Logik!$D$1,3,B31)","v":12},{"$f":"P_D8!$E$9","v":742},{"$f":"P_D8!$E$10","v":0},{"$f":"Logik!AF5","v":112.5},{"$f":"OFFSET(Logik!$D$1,5,B31)","v":18},{"$f":"OFFSET(Logik!$D$1,6,B31)","v":14},{"$f":"P_D8!$E$27","v":0},0]
[null,29,"E8",{"$f":"OFFSET(Logik!$D$1,0,Stat!B32)","v":"E8"},{"$f":"OFFSET(Logik!$D$1,2,B32)","v":20000},{"$f":"OFFSET(Logik!$D$1,3,B32)","v":32},null,null,{"$f":"Logik!AG5","v":0},{"$f":"OFFSET(Logik!$D$1,5,B32)","v":18},{"$f":"OFFSET(Logik!$D$1,6,B32)","v":14},{"$f":"P_E8!$E$27","v":0},0]
[null,30,"F8",{"$f":"OFFSET(Logik!$D$1,0,Stat!B33)","v":"F8"},{"$f":"OFFSET(Logik!$D$1,2,B33)","v":300},{"$f":"OFFSET(Logik!$D$1,3,B33)","v":10},{"$f":"P_F8!$E$9","v":200},{"$f":"P_F8!$E$10","v":0},{"$f":"Logik!AH5","v":37.5},{"$f":"OFFSET(Logik!$D$1,5,B33)","v":16},{"$f":"OFFSET(Logik!$D$1,6,B33)","v":16},{"$f":"P_F8!$E$27","v":0},0]
[null,31,"G8",{"$f":"OFFSET(Logik!$D$1,0,Stat!B34)","v":"G8"},{"$f":"OFFSET(Logik!$D$1,2,B34)","v":300},{"$f":"OFFSET(Logik!$D$1,3,B34)","v":8},{"$f":"P_G8!$E$9","v":100},{"$f":"P_G8!$E$10","v":0},{"$f":"Logik!AI5","v":33.333333333333336},{"$f":"OFFSET(Logik!$D$1,5,B34)","v":14},{"$f":"OFFSET(Logik!$D$1,6,B34)","v":18},{"$f":"P_G8!$E$14","v":2},600]
[null,32,"H8",{"$f":"OFFSET(Logik!$D$1,0,Stat!B35)","v":"H8"},{"$f":"OFFSET(Logik!$D$1,2,B35)","v":500},{"$f":"OFFSET(Logik!$D$1,3,B35)","v":6},{"$f":"P_H8!$E$9","v":408},{"$f":"P_H8!$E$10","v":0},{"$f":"Logik!AJ5","v":50},{"$f":"OFFSET(Logik!$D$1,5,B35)","v":12},{"$f":"OFFSET(Logik!$D$1,6,B35)","v":20},{"$f":"P_H8!$E$14","v":0},0]
[]
["Summa Vit",null,null,null,{"$f":"SUM(E4:E19)","v":23900},{"$f":"SUM(F4:F19)","v":92},{"$f":"SUM(G4:G19)/10","v":215.8},{"$f":"SUM(H4:H19)/5","v":0},{"$f":"SUM(I4:I19)","v":444.58152958152948},{"$f":"SUM(J4:J19)","v":240},{"$f":"SUM(K4:K19)","v":256},null,{"$f":"SUM(M4:M19)","v":2800},null,null,null,null,null,{"$f":"SUM(E37:Q37)","v":27948.381529581529}]
["Summa Svart",null,null,null,{"$f":"SUM(E20:E35)","v":23900},{"$f":"SUM(F20:F35)","v":92},{"$f":"SUM(G20:G35)/10","v":215.8},{"$f":"SUM(H20:H35)/5","v":0},444.58152958152954,{"$f":"SUM(J20:J35)","v":240},{"$f":"SUM(K20:K35)","v":256},null,{"$f":"SUM(M20:M35)","v":2800},null,null,null,null,null,{"$f":"SUM(E38:Q38)","v":27948.381529581529}]

{"sheet":"SpelBraden","index":6,"n_rows":12,"n_cols":33,"rows_kept":12,"cut":false,"hidden":true,"merged":[]}
[]
[null,"Möjliga drag Vit",null,null,null,null,null,null,null,null,null,null,null,"Möjliga drag svart"]
[null,"A","B","C","D","E","F","G","H",null,null,null,null,"A","B","C","D","E","F","G","H",null,null,null,null,"A","B","C","D","E","F","G","H"]
[8,{"$f":"(LEN(allaDVit)-LEN(SUBSTITUTE(allaDVit,B$3&$A4,\"\")))/2","v":0},0,0,0,0,0,0,0,{"$f":"SUM(B4:I4)","v":0},null,null,8,{"$f":"(LEN(allaDSvart)-LEN(SUBSTITUTE(allaDSvart,N$3&$M4,\"\")))/2","v":0},0,0,0,0,0,0,0,{"$f":"SUM(N4:U4)","v":0},null,null,8]
[7,0,0,0,0,0,0,0,0,{"$f":"SUM(B5:I5)","v":0},null,null,7,0,0,0,0,0,0,0,0,0,null,null,7]
[6,0,0,0,0,0,0,0,0,0,null,null,6,2,1,2,1,1,2,1,2,12,null,null,6]
[5,0,0,0,0,0,0,0,0,0,null,null,5,1,1,1,1,1,1,1,1,8,null,null,5]
[4,1,1,1,1,1,1,1,1,8,null,null,4,0,0,0,0,0,0,0,0,0,null,null,4]
[3,2,1,2,1,1,2,1,2,12,null,null,3,0,0,0,0,0,0,0,0,0,null,null,3]
[2,0,0,0,0,0,0,0,0,0,null,null,2,0,0,0,0,0,0,0,0,0,null,null,2]
[1,0,0,0,0,0,0,0,0,0,null,null,1,0,0,0,0,0,0,0,0,0,null,null,1]
[null,{"$f":"SUM(B4:B11)","v":3},{"$f":"SUM(C4:C11)","v":2},3,2,2,3,2,3,null,null,null,null,{"$f":"SUM(N4:N11)","v":3},2,3,2,2,3,2,3,20]

{"sheet":"RensaHistorik","index":7,"n_rows":421,"n_cols":16,"rows_kept":421,"cut":false,"hidden":true,"merged":[]}
[null,null,null,null,null,{"$f":"SUBSTITUTE(Start!P5,\"Q\",\"\")","v":""}]
[null,null,null,null,null,{"$f":"SUBSTITUTE(F1,\"x\",\"\")","v":""}]
[null,null,null,null,null,{"$f":"SUBSTITUTE(F2,\"N\",\"\")","v":""}]
[null,null,null,null,null,{"$f":"SUBSTITUTE(F3,\"+\",\"\")","v":""}]
[null,null,null,null,null,{"$f":"SUBSTITUTE(F4,\"R\",\"\")","v":""}]
[null,null,null,null,null,{"$f":"SUBSTITUTE(F5,\"B\",\"\")","v":""}]
[null,null,null,null,1,{"$f":"SUBSTITUTE(F6,\" \"&E7&\". \",\"\")","v":""}]
[null,null,null,null,2,""]
[null,null,null,null,3,""]
[null,null,null,null,4,""]
[null,null,null,null,5,""]
[null,null,null,null,6,""]
[null,null,null,null,7,""]
[null,null,null,null,8,""]
[null,null,null,null,9,""]
[null,null,null,null,10,""]
[null,null,null,null,11,""]
[null,null,null,null,12,""]
[null,null,null,null,13,""]
[null,null,null,null,14,""]
[null,null,null,null,15,""]
[null,null,null,null,16,""]
[null,null,null,null,17,""]
[null,null,null,null,18,""]
[null,null,null,null,19,""]
[null,null,null,null,20,""]
[null,null,null,null,21,""]
[null,null,null,null,22,""]
[null,null,null,null,23,""]
[null,null,null,null,24,""]
[null,null,null,null,25,""]
[null,null,null,null,26,""]
[null,null,null,null,27,""]
[null,null,null,null,28,""]
[null,null,null,null,29,""]
[null,null,null,null,30,""]
[null,null,null,null,31,""]
[null,null,null,null,32,""]
[null,null,null,null,33,""]
[null,null,null,null,34,""]
[null,null,null,null,35,""]
[null,null,null,null,36,""]
[null,null,null,null,37,""]
[null,null,null,null,38,""]
[null,null,null,null,39,""]
[null,null,null,null,40,""]
[null,null,null,null,41,""]
[null,null,null,null,42,""]
[null,null,null,null,43,""]
[null,null,null,null,44,""]
[null,null,null,null,45,""]
[null,null,null,null,46,""]
[null,null,null,null,47,""]
[null,null,null,null,48,""]
[null,null,null,null,49,""]
[null,null,null,null,50,""]
[null,null,null,null,51,""]
[null,null,null,null,52,""]
[null,null,null,null,53,""]
[null,null,null,null,54,""]
[null,null,null,null,55,""]
[null,null,null,null,56,""]
[null,null,null,null,57,""]
[null,null,null,null,58,""]
[null,null,null,null,59,""]
[null,null,null,null,60,""]
[null,null,null,null,61,""]
[null,null,null,null,62,""]
[null,null,null,null,63,""]
[null,null,null,null,64,""]
[null,null,null,null,65,{"$f":"SUBSTITUTE(F70,\" \"&E71&\". \",\"\")","v":""}]
[null,null,null,null,66,""]
[null,null,null,null,67,""]
[null,null,null,null,68,""]
[null,null,null,null,69,""]
[null,null,null,null,70,""]
[null,null,null,null,71,""]
[null,null,null,null,72,""]
[null,null,null,null,73,""]
[null,null,null,null,74,""]
[null,null,null,null,75,""]
[null,null,null,null,76,""]
[null,null,null,null,77,""]
[null,null,null,null,78,""]
[null,null,null,null,79,""]
[null,null,null,null,80,""]
[null,null,null,null,81,""]
[null,null,null,null,82,""]
[null,null,null,null,83,""]
[null,null,null,null,84,""]
[null,null,null,null,85,""]
[null,null,null,null,86,""]
[null,null,null,null,87,""]
[null,null,null,null,88,""]
[null,null,null,null,89,""]
[null,null,null,null,90,""]
[null,null,null,null,91,""]
[null,null,null,null,92,""]
[null,null,null,null,93,""]
[null,null,null,null,94,""]
[null,null,null,null,95,""]
[null,null,null,null,96,""]
[null,null,null,null,97,""]
[null,null,null,null,98,""]
[null,null,null,null,99,""]
[null,null,null,null,100,""]
[null,null,null,null,101,""]
[null,null,null,null,102,""]
[null,null,null,null,103,""]
[null,null,null,null,104,""]
[null,null,null,null,105,""]
[null,null,null,null,106,""]
[null,null,null,null,107,""]
[null,null,null,null,108,""]
[null,null,null,null,109,""]
[null,null,null,null,110,""]
[null,null,null,null,111,""]
[null,null,null,null,112,""]
[null,null,null,null,113,""]
[null,null,null,null,114,""]
[null,null,null,null,115,""]
[null,null,null,null,116,""]
[null,null,null,null,117,""]
[null,null,null,null,118,""]
[null,null,null,null,119,""]
[null,null,null,null,120,""]
[null,null,null,null,121,""]
[null,null,null,null,122,""]
[null,null,null,null,123,""]
[null,null,null,null,124,""]
[null,null,null,null,125,""]
[null,null,null,null,126,""]
[null,null,null,null,127,""]
[null,null,null,null,128,""]
[null,null,null,null,129,{"$f":"SUBSTITUTE(F134,\" \"&E135&\". \",\"\")","v":""}]
[null,null,null,null,130,""]
[null,null,null,null,131,""]
[null,null,null,null,132,""]
[null,null,null,null,133,""]
[null,null,null,null,134,""]
[null,null,null,null,135,""]
[null,null,null,null,136,""]
[null,null,null,null,137,""]
[null,null,null,null,138,""]
[null,null,null,null,139,""]
[null,null,null,null,140,""]
[null,null,null,null,141,""]
[null,null,null,null,142,""]
[null,null,null,null,143,""]
[null,null,null,null,144,""]
[null,null,null,null,145,""]
[null,null,null,null,146,""]
[null,null,null,null,147,""]
[null,null,null,null,148,""]
[null,null,null,null,149,""]
[null,null,null,null,150,""]
[null,null,null,null,151,""]
[null,null,null,null,152,""]
[null,null,null,null,153,""]
[null,null,null,null,154,""]
[null,null,null,null,155,""]
[null,null,null,null,156,""]
[null,null,null,null,157,""]
[null,null,null,null,158,""]
[null,null,null,null,159,""]
[null,null,null,null,160,""]
[null,null,null,null,161,""]
[null,null,null,null,162,""]
[null,null,null,null,163,""]
[null,null,null,null,164,""]
[null,null,null,null,165,""]
[null,null,null,null,166,""]
[null,null,null,null,167,""]
[null,null,null,null,168,""]
[null,null,null,null,169,""]
[null,null,null,null,170,""]
[null,null,null,null,171,""]
[null,null,null,null,172,""]
[null,null,null,null,173,""]
[null,null,null,null,174,""]
[null,null,null,null,175,""]
[null,null,null,null,176,""]
[null,null,null,null,177,""]
[null,null,null,null,178,""]
[null,null,null,null,179,""]
[null,null,null,null,180,""]
[null,null,null,null,181,""]
[null,null,null,null,182,""]
[null,null,null,null,183,""]
[null,null,null,null,184,""]
[null,null,null,null,185,""]
[null,null,null,null,186,""]
[null,null,null,null,187,""]
[null,null,null,null,188,""]
[null,null,null,null,189,""]
[null,null,null,null,190,""]
[null,null,null,null,191,""]
[null,null,null,null,192,""]
[null,null,null,null,193,{"$f":"SUBSTITUTE(F198,\" \"&E199&\". \",\"\")","v":""}]
[null,null,null,null,194,""]
[null,null,null,null,195,""]
[null,null,null,null,196,""]
[null,null,null,null,197,""]
[null,null,null,null,198,""]
[null,null,null,null,199,""]
[null,null,null,null,200,""]
[null,null,null,null,201,""]
[null,null,null,null,202,""]
[null,null,null,null,203,""]
[null,null,null,null,204,""]
[null,null,null,null,205,""]
[null,null,null,null,206,""]
[null,null,null,null,207,""]
[null,null,null,null,208,""]
[null,null,null,null,209,""]
[null,null,null,null,210,""]
[null,null,null,null,211,""]
[null,null,null,null,212,""]
[null,null,null,null,213,""]
[null,null,null,null,214,""]
[null,null,null,null,215,""]
[null,null,null,null,216,""]
[null,null,null,null,217,""]
[null,null,null,null,218,""]
[null,null,null,null,219,""]
[null,null,null,null,220,""]
[null,null,null,null,221,""]
[null,null,null,null,222,""]
[null,null,null,null,223,""]
[null,null,null,null,224,""]
[null,null,null,null,225,""]
[null,null,null,null,226,""]
[null,null,null,null,227,""]
[null,null,null,null,228,""]
[null,null,null,null,229,""]
[null,null,null,null,230,""]
[null,null,null,null,231,""]
[null,null,null,null,232,""]
[null,null,null,null,233,""]
[null,null,null,null,234,""]
[null,null,null,null,235,""]
[null,null,null,null,236,""]
[null,null,null,null,237,""]
[null,null,null,null,238,""]
[null,null,null,null,239,""]
[null,null,null,null,240,""]
[null,null,null,null,241,""]
[null,null,null,null,242,""]
[null,null,null,null,243,""]
[null,null,null,null,244,""]
[null,null,null,null,245,""]
[null,null,null,null,246,""]
[null,null,null,null,247,""]
[null,null,null,null,248,""]
[null,null,null,null,249,""]
[null,null,null,null,250,""]
[null,null,null,null,251,""]
[null,null,null,null,252,""]
[null,null,null,null,253,""]
[null,null,null,null,254,""]
[null,null,null,null,255,""]
[null,null,null,null,256,""]
[null,null,null,null,257,{"$f":"SUBSTITUTE(F262,\" \"&E263&\". \",\"\")","v":""}]
[null,null,null,null,258,""]
[null,null,null,null,259,""]
[null,null,null,null,260,""]
[null,null,null,null,261,""]
[null,null,null,null,262,""]
[null,null,null,null,263,""]
[null,null,null,null,264,""]
[null,null,null,null,265,""]
[null,null,null,null,266,""]
[null,null,null,null,267,""]
[null,null,null,null,268,""]
[null,null,null,null,269,""]
[null,null,null,null,270,""]
[null,null,null,null,271,""]
[null,null,null,null,272,""]
[null,null,null,null,273,""]
[null,null,null,null,274,""]
[null,null,null,null,275,""]
[null,null,null,null,276,""]
[null,null,null,null,277,""]
[null,null,null,null,278,""]
[null,null,null,null,279,""]
[null,null,null,null,280,""]
[null,null,null,null,281,""]
[null,null,null,null,282,""]
[null,null,null,null,283,""]
[null,null,null,null,284,""]
[null,null,null,null,285,""]
[null,null,null,null,286,""]
[null,null,null,null,287,""]
[null,null,null,null,288,""]
[null,null,null,null,289,""]
[null,null,null,null,290,""]
[null,null,null,null,291,""]
[null,null,null,null,292,""]
[null,null,null,null,293,""]
[null,null,null,null,294,""]
[null,null,null,null,295,""]
[null,null,null,null,296,""]
[null,null,null,null,297,""]
[null,null,null,null,298,""]
[null,null,null,null,299,""]
[null,null,null,null,300,""]
[null,null,null,null,301,""]
[null,null,null,null,302,""]
[null,null,null,null,303,""]
[null,null,null,null,304,""]
[null,null,null,null,305,""]
[null,null,null,null,306,""]
[null,null,null,null,307,""]
[null,null,null,null,308,""]
[null,null,null,null,309,""]
[null,null,null,null,310,""]
[null,null,null,null,311,""]
[null,null,null,null,312,""]
[null,null,null,null,313,""]
[null,null,null,null,314,""]
[null,null,null,null,315,""]
[null,null,null,null,316,""]
[null,null,null,null,317,""]
[null,null,null,null,318,""]
[null,null,null,null,319,""]
[null,null,null,null,320,""]
[null,null,null,null,321,{"$f":"SUBSTITUTE(F326,\" \"&E327&\". \",\"\")","v":""}]
[null,null,null,null,322,""]
[null,null,null,null,323,""]
[null,null,null,null,324,""]
[null,null,null,null,325,""]
[null,null,null,null,326,""]
[null,null,null,null,327,""]
[null,null,null,null,328,""]
[null,null,null,null,329,""]
[null,null,null,null,330,""]
[null,null,null,null,331,""]
[null,null,null,null,332,""]
[null,null,null,null,333,""]
[null,null,null,null,334,""]
[null,null,null,null,335,""]
[null,null,null,null,336,""]
[null,null,null,null,337,""]
[null,null,null,null,338,""]
[null,null,null,null,339,""]
[null,null,null,null,340,""]
[null,null,null,null,341,""]
[null,null,null,null,342,""]
[null,null,null,null,343,""]
[null,null,null,null,344,""]
[null,null,null,null,345,""]
[null,null,null,null,346,""]
[null,null,null,null,347,""]
[null,null,null,null,348,""]
[null,null,null,null,349,""]
[null,null,null,null,350,""]
[null,null,null,null,351,""]
[null,null,null,null,352,""]
[null,null,null,null,353,""]
[null,null,null,null,354,""]
[null,null,null,null,355,""]
[null,null,null,null,356,""]
[null,null,null,null,357,""]
[null,null,null,null,358,""]
[null,null,null,null,359,""]
[null,null,null,null,360,""]
[null,null,null,null,361,""]
[null,null,null,null,362,""]
[null,null,null,null,363,""]
[null,null,null,null,364,""]
[null,null,null,null,365,""]
[null,null,null,null,366,""]
[null,null,null,null,367,""]
[null,null,null,null,368,""]
[null,null,null,null,369,""]
[null,null,null,null,370,""]
[null,null,null,null,371,""]
[null,null,null,null,372,""]
[null,null,null,null,373,""]
[null,null,null,null,374,""]
[null,null,null,null,375,""]
[null,null,null,null,376,""]
[null,null,null,null,377,""]
[null,null,null,null,378,""]
[null,null,null,null,379,""]
[null,null,null,null,380,""]
[null,null,null,null,381,""]
[null,null,null,null,382,""]
[null,null,null,null,383,""]
[null,null,null,null,384,""]
[null,null,null,null,385,{"$f":"SUBSTITUTE(F390,\" \"&E391&\". \",\"\")","v":""}]
[null,null,null,null,386,""]
[null,null,null,null,387,""]
[null,null,null,null,388,""]
[null,null,null,null,389,""]
[null,null,null,null,390,""]
[null,null,null,null,391,""]
[null,null,null,null,392,""]
[null,null,null,null,393,""]
[null,null,null,null,394,""]
[null,null,null,null,395,""]
[null,null,null,null,396,""]
[null,null,null,null,397,""]
[null,null,null,null,398,""]
[null,null,null,null,399,""]
[null,null,null,null,400,""]
[null,null,null,null,"Ta bort \"1-0\"",{"$f":"SUBSTITUTE(F406,\"1-0\",\"\")","v":""}]
[null,null,null,null,"Ta bort \"0-1\"",{"$f":"SUBSTITUTE(F407,\"0-1\",\"\")","v":""}]
[null,null,null,null,"Ta bort \" \"",{"$f":"SUBSTITUTE(F408,\" \",\"\")","v":""}]
[null,null,null,null,"Lägg till nästa drag",{"$f":"F409&nastaDrag","v":""}]
[null,null,null,null,"Ta bort \"1\"",{"$f":"SUBSTITUTE(F410,\"1.\",\"\")","v":""}]
[null,null,null,null,"\"O-O-O\" => \"OOO1\"",{"$f":"SUBSTITUTE(F411,\"O-O-O\",\"OOO1\")","v":""}]
[null,null,null,null,"\"O-O\" => \"OOO2\"",{"$f":"SUBSTITUTE(F412,\"O-O\",\"OOO2\")","v":""}]
[null,null,null,null,"OOO1 => VOO1",{"$f":"IF(AND(IFERROR(FIND(\"OOO1\",F413),0)>0,ISEVEN(IFERROR(FIND(\"OOO1\",F413),0)/4)),P414,F413)","v":""},null,null,null,null,null,null,null,null,{"$f":"FIND(\"OOO1\",F413)","v":{"$error":"#VALUE!"}},{"$f":"LEFT(F413,O414-1)&\"VOO1\"&RIGHT(F413,LEN(F413)-O414-3)","v":{"$error":"#VALUE!"}}]
[null,null,null,null,"OOO1 => SOO1",{"$f":"IF(AND(IFERROR(FIND(\"OOO1\",F414),0)>0,ISODD(IFERROR(FIND(\"OOO1\",F414),0)/4)),SUBSTITUTE(F414,\"OOO1\",\"SOO1\"),F414)","v":""}]
[null,null,null,null,"OOO2 => VOO2",{"$f":"IF(AND(IFERROR(FIND(\"OOO2\",F415),0)>0,ISEVEN(IFERROR(FIND(\"OOO2\",F415),0)/4)),P416,F415)","v":""},null,null,null,null,null,null,null,null,{"$f":"FIND(\"OOO2\",F415)","v":{"$error":"#VALUE!"}},{"$f":"LEFT(F415,O416-1)&\"VOO2\"&RIGHT(F415,LEN(F415)-O416-3)","v":{"$error":"#VALUE!"}}]
[null,null,null,null,"OOO2 => SOO2",{"$f":"IF(AND(IFERROR(FIND(\"OOO2\",F416),0)>0,ISODD(IFERROR(FIND(\"OOO2\",F416),0)/4)),SUBSTITUTE(F416,\"OOO2\",\"SOO2\"),F416)","v":""}]
[null,null,null,null,null,{"$f":"F417","v":""}]
[null,null,null,null,null,""]
[null,null,null,null,null,{"$f":"UPPER(F419)","v":""}]
[null,null,null,null,"Antal:",{"$f":"LEN(RenHistorik)/4","v":0}]

{"sheet":"RVB","index":8,"n_rows":120,"n_cols":6,"rows_kept":120,"cut":false,"hidden":true,"merged":[]}
["Kombo","Pjäs","PosX","PosY","Flytt","Attack"]
[{"$f":"B2&C2&D2","v":"VBA2"},"VB","A",2,{"$f":"C2&D2&IF(D2<8,C2&D2+1,\"\")&IF(D2=2,C2&4,\"\")","v":"A2A3A4"},{"$f":"IF(D2<8,IF(C2<>\"A\",CHAR(CODE(C2)-1)&D2+1,\"\")&IF(C2<>\"H\",CHAR(CODE(C2)+1)&D2+1,\"\"),\"\")","v":"B3"}]
[{"$f":"B3&C3&D3","v":"VBA3"},"VB","A",3,{"$f":"C3&D3&IF(D3<8,C3&D3+1,\"\")&IF(D3=2,C3&4,\"\")","v":"A3A4"},{"$f":"IF(D3<8,IF(C3<>\"A\",CHAR(CODE(C3)-1)&D3+1,\"\")&IF(C3<>\"H\",CHAR(CODE(C3)+1)&D3+1,\"\"),\"\")","v":"B4"}]
["VBA4","VB","A",4,"A4A5","B5"]
["VBA5","VB","A",5,"A5A6","B6"]
["VBA6","VB","A",6,"A6A7","B7"]
["VBA7","VB","A",7,"A7A8","B8"]
["VBA8","VB","A",8,"A8",""]
[{"$f":"B9&C9&D9","v":"VBB1"},"VB","B",1,"B1B2",{"$f":"IF(D9<8,IF(C9<>\"A\",CHAR(CODE(C9)-1)&D9+1,\"\")&IF(C9<>\"H\",CHAR(CODE(C9)+1)&D9+1,\"\"),\"\")","v":"A2C2"}]
[{"$f":"B10&C10&D10","v":"VBB2"},"VB","B",2,"B2B3B4",{"$f":"IF(D10<8,IF(C10<>\"A\",CHAR(CODE(C10)-1)&D10+1,\"\")&IF(C10<>\"H\",CHAR(CODE(C10)+1)&D10+1,\"\"),\"\")","v":"A3C3"}]
["VBB3","VB","B",3,"B3B4","A4C4"]
["VBB4","VB","B",4,"B4B5","A5C5"]
["VBB5","VB","B",5,"B5B6","A6C6"]
["VBB6","VB","B",6,"B6B7","A7C7"]
["VBB7","VB","B",7,"B7B8","A8C8"]
["VBB8","VB","B",8,"B8",""]
[{"$f":"B17&C17&D17","v":"VBC2"},"VB","C",2,"C2C3C4",{"$f":"IF(D17<8,IF(C17<>\"A\",CHAR(CODE(C17)-1)&D17+1,\"\")&IF(C17<>\"H\",CHAR(CODE(C17)+1)&D17+1,\"\"),\"\")","v":"B3D3"}]
[{"$f":"B18&C18&D18","v":"VBC3"},"VB","C",3,"C3C4",{"$f":"IF(D18<8,IF(C18<>\"A\",CHAR(CODE(C18)-1)&D18+1,\"\")&IF(C18<>\"H\",CHAR(CODE(C18)+1)&D18+1,\"\"),\"\")","v":"B4D4"}]
["VBC4","VB","C",4,"C4C5","B5D5"]
["VBC5","VB","C",5,"C5C6","B6D6"]
["VBC6","VB","C",6,"C6C7","B7D7"]
["VBC7","VB","C",7,"C7C8","B8D8"]
["VBC8","VB","C",8,"C8",""]
[{"$f":"B24&C24&D24","v":"VBD2"},"VB","D",2,"D2D3D4",{"$f":"IF(D24<8,IF(C24<>\"A\",CHAR(CODE(C24)-1)&D24+1,\"\")&IF(C24<>\"H\",CHAR(CODE(C24)+1)&D24+1,\"\"),\"\")","v":"C3E3"}]
[{"$f":"B25&C25&D25","v":"VBD3"},"VB","D",3,"D3D4",{"$f":"IF(D25<8,IF(C25<>\"A\",CHAR(CODE(C25)-1)&D25+1,\"\")&IF(C25<>\"H\",CHAR(CODE(C25)+1)&D25+1,\"\"),\"\")","v":"C4E4"}]
["VBD4","VB","D",4,"D4D5","C5E5"]
["VBD5","VB","D",5,"D5D6","C6E6"]
["VBD6","VB","D",6,"D6D7","C7E7"]
["VBD7","VB","D",7,"D7D8","C8E8"]
["VBD8","VB","D",8,"D8",""]
[{"$f":"B31&C31&D31","v":"VBE2"},"VB","E",2,{"$f":"C31&D31&IF(D31<8,C31&D31+1,\"\")&IF(D31=2,C31&4,\"\")","v":"E2E3E4"},{"$f":"IF(D31<8,IF(C31<>\"A\",CHAR(CODE(C31)-1)&D31+1,\"\")&IF(C31<>\"H\",CHAR(CODE(C31)+1)&D31+1,\"\"),\"\")","v":"D3F3"}]
["VBE3","VB","E",3,"E3E4","D4F4"]
["VBE4","VB","E",4,"E4E5","D5F5"]
["VBE5","VB","E",5,"E5E6","D6F6"]
["VBE6","VB","E",6,"E6E7","D7F7"]
["VBE7","VB","E",7,"E7E8","D8F8"]
["VBE8","VB","E",8,"E8",""]
["VBF2","VB","F",2,"F2F3F4","E3G3"]
["VBF3","VB","F",3,"F3F4","E4G4"]
["VBF4","VB","F",4,"F4F5","E5G5"]
["VBF5","VB","F",5,"F5F6","E6G6"]
["VBF6","VB","F",6,"F6F7","E7G7"]
["VBF7","VB","F",7,"F7F8","E8G8"]
["VBF8","VB","F",8,"F8",""]
[{"$f":"B45&C45&D45","v":"VBG1"},"VB","G",1,"G1G2",{"$f":"IF(D45<8,IF(C45<>\"A\",CHAR(CODE(C45)-1)&D45+1,\"\")&IF(C45<>\"H\",CHAR(CODE(C45)+1)&D45+1,\"\"),\"\")","v":"F2H2"}]
["VBG2","VB","G",2,"G2G3G4","F3H3"]
["VBG3","VB","G",3,"G3G4","F4H4"]
["VBG4","VB","G",4,"G4G5","F5H5"]
["VBG5","VB","G",5,"G5G6","F6H6"]
["VBG6","VB","G",6,"G6G7","F7H7"]
["VBG7","VB","G",7,"G7G8","F8H8"]
["VBG8","VB","G",8,"G8",""]
[{"$f":"B53&C53&D53","v":"VBH2"},"VB","H",2,"H2H3H4",{"$f":"IF(D53<8,IF(C53<>\"A\",CHAR(CODE(C53)-1)&D53+1,\"\")&IF(C53<>\"H\",CHAR(CODE(C53)+1)&D53+1,\"\"),\"\")","v":"G3"}]
[{"$f":"B54&C54&D54","v":"VBH3"},"VB","H",3,"H3H4",{"$f":"IF(D54<8,IF(C54<>\"A\",CHAR(CODE(C54)-1)&D54+1,\"\")&IF(C54<>\"H\",CHAR(CODE(C54)+1)&D54+1,\"\"),\"\")","v":"G4"}]
["VBH4","VB","H",4,"H4H5","G5"]
["VBH5","VB","H",5,"H5H6","G6"]
["VBH6","VB","H",6,"H6H7","G7"]
["VBH7","VB","H",7,"H7H8","G8"]
["VBH8","VB","H",8,"H8",""]
[{"$f":"B60&C60&D60","v":"VBH2"},"VB","H",2,"H2H3H4",{"$f":"IF(D60<8,IF(C60<>\"A\",CHAR(CODE(C60)-1)&D60+1,\"\")&IF(C60<>\"H\",CHAR(CODE(C60)+1)&D60+1,\"\"),\"\")","v":"G3"}]
[{"$f":"B61&C61&D61","v":"VBH3"},"VB","H",3,"H3H4",{"$f":"IF(D61<8,IF(C61<>\"A\",CHAR(CODE(C61)-1)&D61+1,\"\")&IF(C61<>\"H\",CHAR(CODE(C61)+1)&D61+1,\"\"),\"\")","v":"G4"}]
["VBH4","VB","H",4,"H4H5","G5"]
["VBH5","VB","H",5,"H5H6","G6"]
["VBH6","VB","H",6,"H6H7","G7"]
["VBH7","VB","H",7,"H7H8","G8"]
["VBH8","VB","H",8,"H8",""]
[{"$f":"B67&C67&D67","v":"SBA1"},"SB","A",1,{"$f":"C67&D67&IF(D67>1,C67&D67-1,\"\")&IF(D67=7,C67&5,\"\")","v":"A1"},{"$f":"IF(D67>1,IF(C67<>\"A\",CHAR(CODE(C67)-1)&D67-1,\"\")&IF(C67<>\"H\",CHAR(CODE(C67)+1)&D67-1,\"\"),\"\")","v":""}]
[{"$f":"B68&C68&D68","v":"SBA2"},"SB","A",2,{"$f":"C68&D68&IF(D68>1,C68&D68-1,\"\")&IF(D68=7,C68&5,\"\")","v":"A2A1"},{"$f":"IF(D68>1,IF(C68<>\"A\",CHAR(CODE(C68)-1)&D68-1,\"\")&IF(C68<>\"H\",CHAR(CODE(C68)+1)&D68-1,\"\"),\"\")","v":"B1"}]
["SBA3","SB","A",3,"A3A2","B2"]
["SBA4","SB","A",4,"A4A3","B3"]
["SBA5","SB","A",5,"A5A4","B4"]
["SBA6","SB","A",6,"A6A5","B5"]
["SBA7","SB","A",7,"A7A6A5","B6"]
[{"$f":"B74&C74&D74","v":"SBB1"},"SB","B",1,"B1",{"$f":"IF(D74>1,IF(C74<>\"A\",CHAR(CODE(C74)-1)&D74-1,\"\")&IF(C74<>\"H\",CHAR(CODE(C74)+1)&D74-1,\"\"),\"\")","v":""}]
[{"$f":"B75&C75&D75","v":"SBB2"},"SB","B",2,"B2B1",{"$f":"IF(D75>1,IF(C75<>\"A\",CHAR(CODE(C75)-1)&D75-1,\"\")&IF(C75<>\"H\",CHAR(CODE(C75)+1)&D75-1,\"\"),\"\")","v":"A1C1"}]
["SBB3","SB","B",3,"B3B2","A2C2"]
["SBB4","SB","B",4,"B4B3","A3C3"]
["SBB5","SB","B",5,"B5B4","A4C4"]
["SBB6","SB","B",6,"B6B5","A5C5"]
["SBB7","SB","B",7,"B7B6B5","A6C6"]
[{"$f":"B81&C81&D81","v":"SBC1"},"SB","C",1,"C1",{"$f":"IF(D81>1,IF(C81<>\"A\",CHAR(CODE(C81)-1)&D81-1,\"\")&IF(C81<>\"H\",CHAR(CODE(C81)+1)&D81-1,\"\"),\"\")","v":""}]
[{"$f":"B82&C82&D82","v":"SBC2"},"SB","C",2,"C2C1",{"$f":"IF(D82>1,IF(C82<>\"A\",CHAR(CODE(C82)-1)&D82-1,\"\")&IF(C82<>\"H\",CHAR(CODE(C82)+1)&D82-1,\"\"),\"\")","v":"B1D1"}]
["SBC3","SB","C",3,"C3C2","B2D2"]
["SBC4","SB","C",4,"C4C3","B3D3"]
["SBC5","SB","C",5,"C5C4","B4D4"]
["SBC6","SB","C",6,"C6C5","B5D5"]
["SBC7","SB","C",7,"C7C6C5","B6D6"]
[{"$f":"B88&C88&D88","v":"SBD2"},"SB","D",2,"D2D1",{"$f":"IF(D88>1,IF(C88<>\"A\",CHAR(CODE(C88)-1)&D88-1,\"\")&IF(C88<>\"H\",CHAR(CODE(C88)+1)&D88-1,\"\"),\"\")","v":"C1E1"}]
["SBD3","SB","D",3,"D3D2","C2E2"]
["SBD4","SB","D",4,"D4D3","C3E3"]
["SBD5","SB","D",5,"D5D4","C4E4"]
["SBD6","SB","D",6,"D6D5","C5E5"]
["SBD7","SB","D",7,"D7D6D5","C6E6"]
[{"$f":"B94&C94&D94","v":"SBE1"},"SB","E",1,"E1",{"$f":"IF(D94>1,IF(C94<>\"A\",CHAR(CODE(C94)-1)&D94-1,\"\")&IF(C94<>\"H\",CHAR(CODE(C94)+1)&D94-1,\"\"),\"\")","v":""}]
[{"$f":"B95&C95&D95","v":"SBE2"},"SB","E",2,"E2E1",{"$f":"IF(D95>1,IF(C95<>\"A\",CHAR(CODE(C95)-1)&D95-1,\"\")&IF(C95<>\"H\",CHAR(CODE(C95)+1)&D95-1,\"\"),\"\")","v":"D1F1"}]
["SBE3","SB","E",3,"E3E2","D2F2"]
["SBE4","SB","E",4,"E4E3","D3F3"]
["SBE5","SB","E",5,"E5E4","D4F4"]
["SBE6","SB","E",6,"E6E5","D5F5"]
["SBE7","SB","E",7,"E7E6E5","D6F6"]
[{"$f":"B101&C101&D101","v":"SBF1"},"SB","F",1,"F1",{"$f":"IF(D101>1,IF(C101<>\"A\",CHAR(CODE(C101)-1)&D101-1,\"\")&IF(C101<>\"H\",CHAR(CODE(C101)+1)&D101-1,\"\"),\"\")","v":""}]
[{"$f":"B102&C102&D102","v":"SBF2"},"SB","F",2,"F2F1",{"$f":"IF(D102>1,IF(C102<>\"A\",CHAR(CODE(C102)-1)&D102-1,\"\")&IF(C102<>\"H\",CHAR(CODE(C102)+1)&D102-1,\"\"),\"\")","v":"E1G1"}]
["SBF3","SB","F",3,"F3F2","E2G2"]
["SBF4","SB","F",4,"F4F3","E3G3"]
["SBF5","SB","F",5,"F5F4","E4G4"]
["SBF6","SB","F",6,"F6F5","E5G5"]
["SBF7","SB","F",7,"F7F6F5","E6G6"]
[{"$f":"B108&C108&D108","v":"SBG1"},"SB","G",1,"G1",{"$f":"IF(D108>1,IF(C108<>\"A\",CHAR(CODE(C108)-1)&D108-1,\"\")&IF(C108<>\"H\",CHAR(CODE(C108)+1)&D108-1,\"\"),\"\")","v":""}]
[{"$f":"B109&C109&D109","v":"SBG2"},"SB","G",2,"G2G1",{"$f":"IF(D109>1,IF(C109<>\"A\",CHAR(CODE(C109)-1)&D109-1,\"\")&IF(C109<>\"H\",CHAR(CODE(C109)+1)&D109-1,\"\"),\"\")","v":"F1H1"}]
["SBG3","SB","G",3,"G3G2","F2H2"]
["SBG4","SB","G",4,"G4G3","F3H3"]
["SBG5","SB","G",5,"G5G4","F4H4"]
["SBG6","SB","G",6,"G6G5","F5H5"]
["SBG7","SB","G",7,"G7G6G5","F6H6"]
["SBH2","SB","H",2,"H2H1","G1"]
["SBH3","SB","H",3,"H3H2","G2"]
["SBH4","SB","H",4,"H4H3","G3"]
["SBH5","SB","H",5,"H5H4","G4"]
["SBH6","SB","H",6,"H6H5","G5"]
["SBH7","SB","H",7,"H7H6H5","G6"]

{"sheet":"RVL","index":9,"n_rows":129,"n_cols":40,"rows_kept":129,"cut":false,"hidden":true,"merged":[]}
["Kombo","Pjäs","PosX","PosY","FlyttA","FlyttB","FlyttC","FlyttD","AttackA","AttackB","AttackC","AttackD"]
[{"$f":"B2&C2&D2","v":"VLA1"},"VL","A",1,{"$f":"$C2&$D2&I2","v":"A1"},{"$f":"C2&D2&J2","v":"A1"},{"$f":"K2","v":""},{"$f":"L2","v":"H8G7F6E5D4C3B2"},{"$f":"CONCATENATE(M2,N2,O2,P2,Q2,R2,S2)","v":""},{"$f":"CONCATENATE(T2,U2,V2,W2,X2,Y2,Z2)","v":""},{"$f":"CONCATENATE(AG2,AF2,AE2,AD2,AC2,AB2,AA2)","v":""},{"$f":"CONCATENATE(AN2,AM2,AL2,AK2,AJ2,AI2,AH2)","v":"H8G7F6E5D4C3B2"},{"$f":"IF(AND($D2-1>0,CODE($C2)-1>64),CHAR(CODE($C2)-1)&$D2-1,\"\")","v":""},{"$f":"IF(AND($D2-2>0,CODE($C2)-2>64),CHAR(CODE($C2)-2)&$D2-2,\"\")","v":""},{"$f":"IF(AND($D2-3>0,CODE($C2)-3>64),CHAR(CODE($C2)-3)&$D2-3,\"\")","v":""},{"$f":"IF(AND($D2-4>0,CODE($C2)-4>64),CHAR(CODE($C2)-4)&$D2-4,\"\")","v":""},{"$f":"IF(AND($D2-5>0,CODE($C2)-5>64),CHAR(CODE($C2)-5)&$D2-5,\"\")","v":""},{"$f":"IF(AND($D2-6>0,CODE($C2)-6>64),CHAR(CODE($C2)-6)&$D2-6,\"\")","v":""},{"$f":"IF(AND($D2-7>0,CODE($C2)-7>64),CHAR(CODE($C2)-7)&$D2-7,\"\")","v":""},{"$f":"IF(AND($D2+1<9,CODE($C2)-1>64),CHAR(CODE($C2)-1)&$D2+1,\"\")","v":""},{"$f":"IF(AND($D2+2<9,CODE($C2)-2>64),CHAR(CODE($C2)-2)&$D2+2,\"\")","v":""},{"$f":"IF(AND($D2+3<9,CODE($C2)-3>64),CHAR(CODE($C2)-3)&$D2+3,\"\")","v":""},{"$f":"IF(AND($D2+4<9,CODE($C2)-4>64),CHAR(CODE($C2)-4)&$D2+4,\"\")","v":""},{"$f":"IF(AND($D2+5<9,CODE($C2)-5>64),CHAR(CODE($C2)-5)&$D2+5,\"\")","v":""},{"$f":"IF(AND($D2+6<9,CODE($C2)-6>64),CHAR(CODE($C2)-6)&$D2+6,\"\")","v":""},{"$f":"IF(AND($D2+7<9,CODE($C2)-7>64),CHAR(CODE($C2)-7)&$D2+7,\"\")","v":""},{"$f":"IF(AND($D2-1>0,CODE($C2)+1<73),CHAR(CODE($C2)+1)&$D2-1,\"\")","v":""},{"$f":"IF(AND($D2-2>0,CODE($C2)+2<73),CHAR(CODE($C2)+2)&$D2-2,\"\")","v":""},{"$f":"IF(AND($D2-3>0,CODE($C2)+3<73),CHAR(CODE($C2)+3)&$D2-3,\"\")","v":""},{"$f":"IF(AND($D2-4>0,CODE($C2)+4<73),CHAR(CODE($C2)+4)&$D2-4,\"\")","v":""},{"$f":"IF(AND($D2-5>0,CODE($C2)+5<73),CHAR(CODE($C2)+5)&$D2-5,\"\")","v":""},{"$f":"IF(AND($D2-6>0,CODE($C2)+6<73),CHAR(CODE($C2)+6)&$D2-6,\"\")","v":""},{"$f":"IF(AND($D2-7>0,CODE($C2)+7<73),CHAR(CODE($C2)+7)&$D2-7,\"\")","v":""},{"$f":"IF(AND($D2+1<9,CODE($C2)+1<73),CHAR(CODE($C2)+1)&$D2+1,\"\")","v":"B2"},{"$f":"IF(AND($D2+2<9,CODE($C2)+2<73),CHAR(CODE($C2)+2)&$D2+2,\"\")","v":"C3"},{"$f":"IF(AND($D2+3<9,CODE($C2)+3<73),CHAR(CODE($C2)+3)&$D2+3,\"\")","v":"D4"},{"$f":"IF(AND($D2+4<9,CODE($C2)+4<73),CHAR(CODE($C2)+4)&$D2+4,\"\")","v":"E5"},{"$f":"IF(AND($D2+5<9,CODE($C2)+5<73),CHAR(CODE($C2)+5)&$D2+5,\"\")","v":"F6"},{"$f":"IF(AND($D2+6<9,CODE($C2)+6<73),CHAR(CODE($C2)+6)&$D2+6,\"\")","v":"G7"},{"$f":"IF(AND($D2+7<9,CODE($C2)+7<73),CHAR(CODE($C2)+7)&$D2+7,\"\")","v":"H8"}]
[{"$f":"B3&C3&D3","v":"VLA2"},"VL","A",2,{"$f":"$C3&$D3&I3","v":"A2"},{"$f":"C3&D3&J3","v":"A2"},{"$f":"K3","v":"B1"},{"$f":"L3","v":"G8F7E6D5C4B3"},{"$f":"CONCATENATE(M3,N3,O3,P3,Q3,R3,S3)","v":""},{"$f":"CONCATENATE(T3,U3,V3,W3,X3,Y3,Z3)","v":""},{"$f":"CONCATENATE(AG3,AF3,AE3,AD3,AC3,AB3,AA3)","v":"B1"},{"$f":"CONCATENATE(AN3,AM3,AL3,AK3,AJ3,AI3,AH3)","v":"G8F7E6D5C4B3"},{"$f":"IF(AND($D3-1>0,CODE($C3)-1>64),CHAR(CODE($C3)-1)&$D3-1,\"\")","v":""},{"$f":"IF(AND($D3-2>0,CODE($C3)-2>64),CHAR(CODE($C3)-2)&$D3-2,\"\")","v":""},{"$f":"IF(AND($D3-3>0,CODE($C3)-3>64),CHAR(CODE($C3)-3)&$D3-3,\"\")","v":""},{"$f":"IF(AND($D3-4>0,CODE($C3)-4>64),CHAR(CODE($C3)-4)&$D3-4,\"\")","v":""},{"$f":"IF(AND($D3-5>0,CODE($C3)-5>64),CHAR(CODE($C3)-5)&$D3-5,\"\")","v":""},{"$f":"IF(AND($D3-6>0,CODE($C3)-6>64),CHAR(CODE($C3)-6)&$D3-6,\"\")","v":""},{"$f":"IF(AND($D3-7>0,CODE($C3)-7>64),CHAR(CODE($C3)-7)&$D3-7,\"\")","v":""},{"$f":"IF(AND($D3+1<9,CODE($C3)-1>64),CHAR(CODE($C3)-1)&$D3+1,\"\")","v":""},{"$f":"IF(AND($D3+2<9,CODE($C3)-2>64),CHAR(CODE($C3)-2)&$D3+2,\"\")","v":""},{"$f":"IF(AND($D3+3<9,CODE($C3)-3>64),CHAR(CODE($C3)-3)&$D3+3,\"\")","v":""},{"$f":"IF(AND($D3+4<9,CODE($C3)-4>64),CHAR(CODE($C3)-4)&$D3+4,\"\")","v":""},{"$f":"IF(AND($D3+5<9,CODE($C3)-5>64),CHAR(CODE($C3)-5)&$D3+5,\"\")","v":""},{"$f":"IF(AND($D3+6<9,CODE($C3)-6>64),CHAR(CODE($C3)-6)&$D3+6,\"\")","v":""},{"$f":"IF(AND($D3+7<9,CODE($C3)-7>64),CHAR(CODE($C3)-7)&$D3+7,\"\")","v":""},{"$f":"IF(AND($D3-1>0,CODE($C3)+1<73),CHAR(CODE($C3)+1)&$D3-1,\"\")","v":"B1"},{"$f":"IF(AND($D3-2>0,CODE($C3)+2<73),CHAR(CODE($C3)+2)&$D3-2,\"\")","v":""},{"$f":"IF(AND($D3-3>0,CODE($C3)+3<73),CHAR(CODE($C3)+3)&$D3-3,\"\")","v":""},{"$f":"IF(AND($D3-4>0,CODE($C3)+4<73),CHAR(CODE($C3)+4)&$D3-4,\"\")","v":""},{"$f":"IF(AND($D3-5>0,CODE($C3)+5<73),CHAR(CODE($C3)+5)&$D3-5,\"\")","v":""},{"$f":"IF(AND($D3-6>0,CODE($C3)+6<73),CHAR(CODE($C3)+6)&$D3-6,\"\")","v":""},{"$f":"IF(AND($D3-7>0,CODE($C3)+7<73),CHAR(CODE($C3)+7)&$D3-7,\"\")","v":""},{"$f":"IF(AND($D3+1<9,CODE($C3)+1<73),CHAR(CODE($C3)+1)&$D3+1,\"\")","v":"B3"},{"$f":"IF(AND($D3+2<9,CODE($C3)+2<73),CHAR(CODE($C3)+2)&$D3+2,\"\")","v":"C4"},{"$f":"IF(AND($D3+3<9,CODE($C3)+3<73),CHAR(CODE($C3)+3)&$D3+3,\"\")","v":"D5"},{"$f":"IF(AND($D3+4<9,CODE($C3)+4<73),CHAR(CODE($C3)+4)&$D3+4,\"\")","v":"E6"},{"$f":"IF(AND($D3+5<9,CODE($C3)+5<73),CHAR(CODE($C3)+5)&$D3+5,\"\")","v":"F7"},{"$f":"IF(AND($D3+6<9,CODE($C3)+6<73),CHAR(CODE($C3)+6)&$D3+6,\"\")","v":"G8"},{"$f":"IF(AND($D3+7<9,CODE($C3)+7<73),CHAR(CODE($C3)+7)&$D3+7,\"\")","v":""}]
["VLA3","VL","A",3,"A3","A3","C1B2","F8E7D6C5B4","","","C1B2","F8E7D6C5B4","","","","","","","","","","","","","","","B2","C1","","","","","","B4","C5","D6","E7","F8","",""]
["VLA4","VL","A",4,{"$f":"$C5&$D5&I5","v":"A4"},"A4","D1C2B3","E8D7C6B5","","","D1C2B3","E8D7C6B5","","","","","","","","","","","","","","","B3","C2","D1","","","","","B5","C6","D7","E8","","",""]
["VLA5","VL","A",5,{"$f":"$C6&$D6&I6","v":"A5"},"A5","E1D2C3B4","D8C7B6","","","E1D2C3B4","D8C7B6","","","","","","","","","","","","","","","B4","C3","D2","E1","","","","B6","C7","D8","","","",""]
["VLA6","VL","A",6,"A6","A6","F1E2D3C4B5","C8B7","","","F1E2D3C4B5","C8B7","","","","","","","","","","","","","","","B5","C4","D3","E2","F1","","","B7","C8","","","","",""]
["VLA7","VL","A",7,{"$f":"$C8&$D8&I8","v":"A7"},"A7","G1F2E3D4C5B6","B8","","","G1F2E3D4C5B6","B8","","","","","","","","","","","","","","","B6","C5","D4","E3","F2","G1","","B8","","","","","",""]
["VLA8","VL","A",8,"A8","A8","H1G2F3E4D5C6B7","","","","H1G2F3E4D5C6B7","","","","","","","","","","","","","","","","B7","C6","D5","E4","F3","G2","H1","","","","","","",""]
["VLB1","VL","B",1,"B1","B1A2","","H7G6F5E4D3C2","","A2","","H7G6F5E4D3C2","","","","","","","","A2","","","","","","","","","","","","","","C2","D3","E4","F5","G6","H7",""]
["VLB2","VL","B",2,"B2A1","B2A3","C1","H8G7F6E5D4C3","A1","A3","C1","H8G7F6E5D4C3","A1","","","","","","","A3","","","","","","","C1","","","","","","","C3","D4","E5","F6","G7","H8",""]
["VLB3","VL","B",3,"B3A2","B3A4","D1C2","G8F7E6D5C4","A2","A4","D1C2","G8F7E6D5C4","A2","","","","","","","A4","","","","","","","C2","D1","","","","","","C4","D5","E6","F7","G8","",""]
["VLB4","VL","B",4,"B4A3","B4A5","E1D2C3","F8E7D6C5","A3","A5","E1D2C3","F8E7D6C5","A3","","","","","","","A5","","","","","","","C3","D2","E1","","","","","C5","D6","E7","F8","","",""]
["VLB5","VL","B",5,"B5A4","B5A6","F1E2D3C4","E8D7C6","A4","A6","F1E2D3C4","E8D7C6","A4","","","","","","","A6","","","","","","","C4","D3","E2","F1","","","","C6","D7","E8","","","",""]
["VLB6","VL","B",6,"B6A5","B6A7","G1F2E3D4C5","D8C7","A5","A7","G1F2E3D4C5","D8C7","A5","","","","","","","A7","","","","","","","C5","D4","E3","F2","G1","","","C7","D8","","","","",""]
["VLB7","VL","B",7,"B7A6","B7A8","H1G2F3E4D5C6","C8","A6","A8","H1G2F3E4D5C6","C8","A6","","","","","","","A8","","","","","","","C6","D5","E4","F3","G2","H1","","C8","","","","","",""]
["VLB8","VL","B",8,"B8A7","B8","H2G3F4E5D6C7","","A7","","H2G3F4E5D6C7","","A7","","","","","","","","","","","","","","C7","D6","E5","F4","G3","H2","","","","","","","",""]
["VLC1","VL","C",1,"C1","C1B2A3","","H6G5F4E3D2","","B2A3","","H6G5F4E3D2","","","","","","","","B2","A3","","","","","","","","","","","","","D2","E3","F4","G5","H6","",""]
[{"$f":"B19&C19&D19","v":"VLC2"},"VL","C",2,"C2B1","C2B3A4","D1","H7G6F5E4D3","B1","B3A4","D1","H7G6F5E4D3","B1","","","","","","","B3","A4","","","","","","D1","","","","","","","D3","E4","F5","G6","H7","",""]
[{"$f":"B20&C20&D20","v":"VLC3"},"VL","C",3,"C3B2A1","C3B4A5","E1D2","H8G7F6E5D4","B2A1","B4A5","E1D2","H8G7F6E5D4","B2","A1","","","","","","B4","A5","","","","","","D2","E1","","","","","","D4","E5","F6","G7","H8","",""]
["VLC4","VL","C",4,"C4B3A2","C4B5A6","F1E2D3","G8F7E6D5","B3A2","B5A6","F1E2D3","G8F7E6D5","B3","A2","","","","","","B5","A6","","","","","","D3","E2","F1","","","","","D5","E6","F7","G8","","",""]
["VLC5","VL","C",5,"C5B4A3","C5B6A7","G1F2E3D4","F8E7D6","B4A3","B6A7","G1F2E3D4","F8E7D6","B4","A3","","","","","","B6","A7","","","","","","D4","E3","F2","G1","","","","D6","E7","F8","","","",""]
["VLC6","VL","C",6,"C6B5A4","C6B7A8","H1G2F3E4D5","E8D7","B5A4","B7A8","H1G2F3E4D5","E8D7","B5","A4","","","","","","B7","A8","","","","","","D5","E4","F3","G2","H1","","","D7","E8","","","","",""]
["VLC7","VL","C",7,"C7B6A5","C7B8","H2G3F4E5D6","D8","B6A5","B8","H2G3F4E5D6","D8","B6","A5","","","","","","B8","","","","","","","D6","E5","F4","G3","H2","","","D8","","","","","",""]
["VLC8","VL","C",8,"C8B7A6","C8","H3G4F5E6D7","","B7A6","","H3G4F5E6D7","","B7","A6","","","","","","","","","","","","","D7","E6","F5","G4","H3","","","","","","","","",""]
["VLD1","VL","D",1,"D1","D1C2B3A4","","H5G4F3E2","","C2B3A4","","H5G4F3E2","","","","","","","","C2","B3","A4","","","","","","","","","","","","E2","F3","G4","H5","","",""]
[{"$f":"B27&C27&D27","v":"VLD2"},"VL","D",2,"D2C1","D2C3B4A5","E1","H6G5F4E3","C1","C3B4A5","E1","H6G5F4E3","C1","","","","","","","C3","B4","A5","","","","","E1","","","","","","","E3","F4","G5","H6","","",""]
[{"$f":"B28&C28&D28","v":"VLD3"},"VL","D",3,"D3C2B1","D3C4B5A6","F1E2","H7G6F5E4","C2B1","C4B5A6","F1E2","H7G6F5E4","C2","B1","","","","","","C4","B5","A6","","","","","E2","F1","","","","","","E4","F5","G6","H7","","",""]
["VLD4","VL","D",4,"D4C3B2A1","D4C5B6A7","G1F2E3","H8G7F6E5","C3B2A1","C5B6A7","G1F2E3","H8G7F6E5","C3","B2","A1","","","","","C5","B6","A7","","","","","E3","F2","G1","","","","","E5","F6","G7","H8","","",""]
["VLD5","VL","D",5,"D5C4B3A2","D5C6B7A8","H1G2F3E4","G8F7E6","C4B3A2","C6B7A8","H1G2F3E4","G8F7E6","C4","B3","A2","","","","","C6","B7","A8","","","","","E4","F3","G2","H1","","","","E6","F7","G8","","","",""]
["VLD6","VL","D",6,"D6C5B4A3","D6C7B8","H2G3F4E5","F8E7","C5B4A3","C7B8","H2G3F4E5","F8E7","C5","B4","A3","","","","","C7","B8","","","","","","E5","F4","G3","H2","","","","E7","F8","","","","",""]
["VLD7","VL","D",7,"D7C6B5A4","D7C8","H3G4F5E6","E8","C6B5A4","C8","H3G4F5E6","E8","C6","B5","A4","","","","","C8","","","","","","","E6","F5","G4","H3","","","","E8","","","","","",""]
["VLD8","VL","D",8,"D8C7B6A5","D8","H4G5F6E7","","C7B6A5","","H4G5F6E7","","C7","B6","A5","","","","","","","","","","","","E7","F6","G5","H4","","","","","","","","","",""]
["VLE1","VL","E",1,"E1","E1D2C3B4A5","","H4G3F2","","D2C3B4A5","","H4G3F2","","","","","","","","D2","C3","B4","A5","","","","","","","","","","","F2","G3","H4","","","",""]
["VLE2","VL","E",2,"E2D1","E2D3C4B5A6","F1","H5G4F3","D1","D3C4B5A6","F1","H5G4F3","D1","","","","","","","D3","C4","B5","A6","","","","F1","","","","","","","F3","G4","H5","","","",""]
["VLE3","VL","E",3,"E3D2C1","E3D4C5B6A7","G1F2","H6G5F4","D2C1","D4C5B6A7","G1F2","H6G5F4","D2","C1","","","","","","D4","C5","B6","A7","","","","F2","G1","","","","","","F4","G5","H6","","","",""]
["VLE4","VL","E",4,"E4D3C2B1","E4D5C6B7A8","H1G2F3","H7G6F5","D3C2B1","D5C6B7A8","H1G2F3","H7G6F5","D3","C2","B1","","","","","D5","C6","B7","A8","","","","F3","G2","H1","","","","","F5","G6","H7","","","",""]
["VLE5","VL","E",5,"E5D4C3B2A1","E5D6C7B8","H2G3F4","H8G7F6","D4C3B2A1","D6C7B8","H2G3F4","H8G7F6","D4","C3","B2","A1","","","","D6","C7","B8","","","","","F4","G3","H2","","","","","F6","G7","H8","","","",""]
["VLE6","VL","E",6,"E6D5C4B3A2","E6D7C8","H3G4F5","G8F7","D5C4B3A2","D7C8","H3G4F5","G8F7","D5","C4","B3","A2","","","","D7","C8","","","","","","F5","G4","H3","","","","","F7","G8","","","","",""]
["VLE7","VL","E",7,"E7D6C5B4A3","E7D8","H4G5F6","F8","D6C5B4A3","D8","H4G5F6","F8","D6","C5","B4","A3","","","","D8","","","","","","","F6","G5","H4","","","","","F8","","","","","",""]
["VLE8","VL","E",8,"E8D7C6B5A4","E8","H5G6F7","","D7C6B5A4","","H5G6F7","","D7","C6","B5","A4","","","","","","","","","","","F7","G6","H5","","","","","","","","","","",""]
["VLF1","VL","F",1,"F1","F1E2D3C4B5A6","","H3G2","","E2D3C4B5A6","","H3G2","","","","","","","","E2","D3","C4","B5","A6","","","","","","","","","","G2","H3","","","","",""]
["VLF2","VL","F",2,"F2E1","F2E3D4C5B6A7","G1","H4G3","E1","E3D4C5B6A7","G1","H4G3","E1","","","","","","","E3","D4","C5","B6","A7","","","G1","","","","","","","G3","H4","","","","",""]
["VLF3","VL","F",3,"F3E2D1","F3E4D5C6B7A8","H1G2","H5G4","E2D1","E4D5C6B7A8","H1G2","H5G4","E2","D1","","","","","","E4","D5","C6","B7","A8","","","G2","H1","","","","","","G4","H5","","","","",""]
["VLF4","VL","F",4,"F4E3D2C1","F4E5D6C7B8","H2G3","H6G5","E3D2C1","E5D6C7B8","H2G3","H6G5","E3","D2","C1","","","","","E5","D6","C7","B8","","","","G3","H2","","","","","","G5","H6","","","","",""]
["VLF5","VL","F",5,"F5E4D3C2B1","F5E6D7C8","H3G4","H7G6","E4D3C2B1","E6D7C8","H3G4","H7G6","E4","D3","C2","B1","","","","E6","D7","C8","","","","","G4","H3","","","","","","G6","H7","","","","",""]
["VLF6","VL","F",6,"F6E5D4C3B2A1","F6E7D8","H4G5","H8G7","E5D4C3B2A1","E7D8","H4G5","H8G7","E5","D4","C3","B2","A1","","","E7","D8","","","","","","G5","H4","","","","","","G7","H8","","","","",""]
["VLF7","VL","F",7,"F7E6D5C4B3A2","F7E8","H5G6","G8","E6D5C4B3A2","E8","H5G6","G8","E6","D5","C4","B3","A2","","","E8","","","","","","","G6","H5","","","","","","G8","","","","","",""]
["VLF8","VL","F",8,"F8E7D6C5B4A3","F8","H6G7","","E7D6C5B4A3","","H6G7","","E7","D6","C5","B4","A3","","","","","","","","","","G7","H6","","","","","","","","","","","",""]
["VLG1","VL","G",1,"G1","G1F2E3D4C5B6A7","","H2","","F2E3D4C5B6A7","","H2","","","","","","","","F2","E3","D4","C5","B6","A7","","","","","","","","","H2","","","","","",""]
["VLG2","VL","G",2,"G2F1","G2F3E4D5C6B7A8","H1","H3","F1","F3E4D5C6B7A8","H1","H3","F1","","","","","","","F3","E4","D5","C6","B7","A8","","H1","","","","","","","H3","","","","","",""]
["VLG3","VL","G",3,"G3F2E1","G3F4E5D6C7B8","H2","H4","F2E1","F4E5D6C7B8","H2","H4","F2","E1","","","","","","F4","E5","D6","C7","B8","","","H2","","","","","","","H4","","","","","",""]
["VLG4","VL","G",4,"G4F3E2D1","G4F5E6D7C8","H3","H5","F3E2D1","F5E6D7C8","H3","H5","F3","E2","D1","","","","","F5","E6","D7","C8","","","","H3","","","","","","","H5","","","","","",""]
["VLG5","VL","G",5,"G5F4E3D2C1","G5F6E7D8","H4","H6","F4E3D2C1","F6E7D8","H4","H6","F4","E3","D2","C1","","","","F6","E7","D8","","","","","H4","","","","","","","H6","","","","","",""]
["VLG6","VL","G",6,"G6F5E4D3C2B1","G6F7E8","H5","H7","F5E4D3C2B1","F7E8","H5","H7","F5","E4","D3","C2","B1","","","F7","E8","","","","","","H5","","","","","","","H7","","","","","",""]
["VLG7","VL","G",7,"G7F6E5D4C3B2A1","G7F8","H6","H8","F6E5D4C3B2A1","F8","H6","H8","F6","E5","D4","C3","B2","A1","","F8","","","","","","","H6","","","","","","","H8","","","","","",""]
["VLG8","VL","G",8,"G8F7E6D5C4B3A2","G8","H7","","F7E6D5C4B3A2","","H7","","F7","E6","D5","C4","B3","A2","","","","","","","","","H7","","","","","","","","","","","","",""]
["VLH1","VL","H",1,"H1","H1G2F3E4D5C6B7A8","","","","G2F3E4D5C6B7A8","","","","","","","","","","G2","F3","E4","D5","C6","B7","A8","","","","","","","","","","","","","",""]
[{"$f":"B59&C59&D59","v":"VLH2"},"VL","H",2,"H2G1","H2G3F4E5D6C7B8","","","G1","G3F4E5D6C7B8","","","G1","","","","","","","G3","F4","E5","D6","C7","B8","","","","","","","","","","","","","","",""]
[{"$f":"B60&C60&D60","v":"VLH3"},"VL","H",3,"H3G2F1","H3G4F5E6D7C8","","","G2F1","G4F5E6D7C8","","","G2","F1","","","","","","G4","F5","E6","D7","C8","","","","","","","","","","","","","","","",""]
["VLH4","VL","H",4,"H4G3F2E1","H4G5F6E7D8","","","G3F2E1","G5F6E7D8","","","G3","F2","E1","","","","","G5","F6","E7","D8","","","","","","","","","","","","","","","","",""]
["VLH5","VL","H",5,"H5G4F3E2D1","H5G6F7E8","","","G4F3E2D1","G6F7E8","","","G4","F3","E2","D1","","","","G6","F7","E8","","","","","","","","","","","","","","","","","",""]
["VLH6","VL","H",6,"H6G5F4E3D2C1","H6G7F8","","","G5F4E3D2C1","G7F8","","","G5","F4","E3","D2","C1","","","G7","F8","","","","","","","","","","","","","","","","","","",""]
["VLH7","VL","H",7,"H7G6F5E4D3C2B1","H7G8","","","G6F5E4D3C2B1","G8","","","G6","F5","E4","D3","C2","B1","","G8","","","","","","","","","","","","","","","","","","","",""]
["VLH8","VL","H",8,"H8G7F6E5D4C3B2A1","H8","","","G7F6E5D4C3B2A1","","","","G7","F6","E5","D4","C3","B2","A1","","","","","","","","","","","","","","","","","","","","",""]
[{"$f":"B66&C66&D66","v":"SLA1"},"SL","A",1,"A1","A1","","H8G7F6E5D4C3B2","","","","H8G7F6E5D4C3B2","","","","","","","","","","","","","","","","","","","","","","B2","C3","D4","E5","F6","G7","H8"]
[{"$f":"B67&C67&D67","v":"SLA2"},"SL","A",2,{"$f":"$C67&$D67&I67","v":"A2"},{"$f":"C67&D67&J67","v":"A2"},{"$f":"K67","v":"B1"},{"$f":"L67","v":"G8F7E6D5C4B3"},{"$f":"CONCATENATE(M67,N67,O67,P67,Q67,R67,S67)","v":""},{"$f":"CONCATENATE(T67,U67,V67,W67,X67,Y67,Z67)","v":""},{"$f":"CONCATENATE(AG67,AF67,AE67,AD67,AC67,AB67,AA67)","v":"B1"},{"$f":"CONCATENATE(AN67,AM67,AL67,AK67,AJ67,AI67,AH67)","v":"G8F7E6D5C4B3"},{"$f":"IF(AND($D67-1>0,CODE($C67)-1>64),CHAR(CODE($C67)-1)&$D67-1,\"\")","v":""},{"$f":"IF(AND($D67-2>0,CODE($C67)-2>64),CHAR(CODE($C67)-2)&$D67-2,\"\")","v":""},{"$f":"IF(AND($D67-3>0,CODE($C67)-3>64),CHAR(CODE($C67)-3)&$D67-3,\"\")","v":""},{"$f":"IF(AND($D67-4>0,CODE($C67)-4>64),CHAR(CODE($C67)-4)&$D67-4,\"\")","v":""},{"$f":"IF(AND($D67-5>0,CODE($C67)-5>64),CHAR(CODE($C67)-5)&$D67-5,\"\")","v":""},{"$f":"IF(AND($D67-6>0,CODE($C67)-6>64),CHAR(CODE($C67)-6)&$D67-6,\"\")","v":""},{"$f":"IF(AND($D67-7>0,CODE($C67)-7>64),CHAR(CODE($C67)-7)&$D67-7,\"\")","v":""},{"$f":"IF(AND($D67+1<9,CODE($C67)-1>64),CHAR(CODE($C67)-1)&$D67+1,\"\")","v":""},{"$f":"IF(AND($D67+2<9,CODE($C67)-2>64),CHAR(CODE($C67)-2)&$D67+2,\"\")","v":""},{"$f":"IF(AND($D67+3<9,CODE($C67)-3>64),CHAR(CODE($C67)-3)&$D67+3,\"\")","v":""},{"$f":"IF(AND($D67+4<9,CODE($C67)-4>64),CHAR(CODE($C67)-4)&$D67+4,\"\")","v":""},{"$f":"IF(AND($D67+5<9,CODE($C67)-5>64),CHAR(CODE($C67)-5)&$D67+5,\"\")","v":""},{"$f":"IF(AND($D67+6<9,CODE($C67)-6>64),CHAR(CODE($C67)-6)&$D67+6,\"\")","v":""},{"$f":"IF(AND($D67+7<9,CODE($C67)-7>64),CHAR(CODE($C67)-7)&$D67+7,\"\")","v":""},{"$f":"IF(AND($D67-1>0,CODE($C67)+1<73),CHAR(CODE($C67)+1)&$D67-1,\"\")","v":"B1"},{"$f":"IF(AND($D67-2>0,CODE($C67)+2<73),CHAR(CODE($C67)+2)&$D67-2,\"\")","v":""},{"$f":"IF(AND($D67-3>0,CODE($C67)+3<73),CHAR(CODE($C67)+3)&$D67-3,\"\")","v":""},{"$f":"IF(AND($D67-4>0,CODE($C67)+4<73),CHAR(CODE($C67)+4)&$D67-4,\"\")","v":""},{"$f":"IF(AND($D67-5>0,CODE($C67)+5<73),CHAR(CODE($C67)+5)&$D67-5,\"\")","v":""},{"$f":"IF(AND($D67-6>0,CODE($C67)+6<73),CHAR(CODE($C67)+6)&$D67-6,\"\")","v":""},{"$f":"IF(AND($D67-7>0,CODE($C67)+7<73),CHAR(CODE($C67)+7)&$D67-7,\"\")","v":""},{"$f":"IF(AND($D67+1<9,CODE($C67)+1<73),CHAR(CODE($C67)+1)&$D67+1,\"\")","v":"B3"},{"$f":"IF(AND($D67+2<9,CODE($C67)+2<73),CHAR(CODE($C67)+2)&$D67+2,\"\")","v":"C4"},{"$f":"IF(AND($D67+3<9,CODE($C67)+3<73),CHAR(CODE($C67)+3)&$D67+3,\"\")","v":"D5"},{"$f":"IF(AND($D67+4<9,CODE($C67)+4<73),CHAR(CODE($C67)+4)&$D67+4,\"\")","v":"E6"},{"$f":"IF(AND($D67+5<9,CODE($C67)+5<73),CHAR(CODE($C67)+5)&$D67+5,\"\")","v":"F7"},{"$f":"IF(AND($D67+6<9,CODE($C67)+6<73),CHAR(CODE($C67)+6)&$D67+6,\"\")","v":"G8"},{"$f":"IF(AND($D67+7<9,CODE($C67)+7<73),CHAR(CODE($C67)+7)&$D67+7,\"\")","v":""}]
["SLA3","SL","A",3,"A3","A3","C1B2","F8E7D6C5B4","","","C1B2","F8E7D6C5B4","","","","","","","","","","","","","","","B2","C1","","","","","","B4","C5","D6","E7","F8","",""]
["SLA4","SL","A",4,"A4","A4","D1C2B3","E8D7C6B5","","","D1C2B3","E8D7C6B5","","","","","","","","","","","","","","","B3","C2","D1","","","","","B5","C6","D7","E8","","",""]
["SLA5","SL","A",5,"A5","A5","E1D2C3B4","D8C7B6","","","E1D2C3B4","D8C7B6","","","","","","","","","","","","","","","B4","C3","D2","E1","","","","B6","C7","D8","","","",""]
["SLA6","SL","A",6,"A6","A6","F1E2D3C4B5","C8B7","","","F1E2D3C4B5","C8B7","","","","","","","","","","","","","","","B5","C4","D3","E2","F1","","","B7","C8","","","","",""]
["SLA7","SL","A",7,"A7","A7","G1F2E3D4C5B6","B8","","","G1F2E3D4C5B6","B8","","","","","","","","","","","","","","","B6","C5","D4","E3","F2","G1","","B8","","","","","",""]
["SLA8","SL","A",8,"A8","A8","H1G2F3E4D5C6B7","","","","H1G2F3E4D5C6B7","","","","","","","","","","","","","","","","B7","C6","D5","E4","F3","G2","H1","","","","","","",""]
["SLB1","SL","B",1,"B1","B1A2","","H7G6F5E4D3C2","","A2","","H7G6F5E4D3C2","","","","","","","","A2","","","","","","","","","","","","","","C2","D3","E4","F5","G6","H7",""]
["SLB2","SL","B",2,"B2A1","B2A3","C1","H8G7F6E5D4C3","A1","A3","C1","H8G7F6E5D4C3","A1","","","","","","","A3","","","","","","","C1","","","","","","","C3","D4","E5","F6","G7","H8",""]
["SLB3","SL","B",3,"B3A2","B3A4","D1C2","G8F7E6D5C4","A2","A4","D1C2","G8F7E6D5C4","A2","","","","","","","A4","","","","","","","C2","D1","","","","","","C4","D5","E6","F7","G8","",""]
["SLB4","SL","B",4,"B4A3","B4A5","E1D2C3","F8E7D6C5","A3","A5","E1D2C3","F8E7D6C5","A3","","","","","","","A5","","","","","","","C3","D2","E1","","","","","C5","D6","E7","F8","","",""]
["SLB5","SL","B",5,"B5A4","B5A6","F1E2D3C4","E8D7C6","A4","A6","F1E2D3C4","E8D7C6","A4","","","","","","","A6","","","","","","","C4","D3","E2","F1","","","","C6","D7","E8","","","",""]
["SLB6","SL","B",6,"B6A5","B6A7","G1F2E3D4C5","D8C7","A5","A7","G1F2E3D4C5","D8C7","A5","","","","","","","A7","","","","","","","C5","D4","E3","F2","G1","","","C7","D8","","","","",""]
["SLB7","SL","B",7,"B7A6","B7A8","H1G2F3E4D5C6","C8","A6","A8","H1G2F3E4D5C6","C8","A6","","","","","","","A8","","","","","","","C6","D5","E4","F3","G2","H1","","C8","","","","","",""]
["SLB8","SL","B",8,"B8A7","B8","H2G3F4E5D6C7","","A7","","H2G3F4E5D6C7","","A7","","","","","","","","","","","","","","C7","D6","E5","F4","G3","H2","","","","","","","",""]
["SLC1","SL","C",1,"C1","C1B2A3","","H6G5F4E3D2","","B2A3","","H6G5F4E3D2","","","","","","","","B2","A3","","","","","","","","","","","","","D2","E3","F4","G5","H6","",""]
[{"$f":"B83&C83&D83","v":"SLC2"},"SL","C",2,"C2B1","C2B3A4","D1","H7G6F5E4D3","B1","B3A4","D1","H7G6F5E4D3","B1","","","","","","","B3","A4","","","","","","D1","","","","","","","D3","E4","F5","G6","H7","",""]
[{"$f":"B84&C84&D84","v":"SLC3"},"SL","C",3,"C3B2A1","C3B4A5","E1D2","H8G7F6E5D4","B2A1","B4A5","E1D2","H8G7F6E5D4","B2","A1","","","","","","B4","A5","","","","","","D2","E1","","","","","","D4","E5","F6","G7","H8","",""]
["SLC4","SL","C",4,"C4B3A2","C4B5A6","F1E2D3","G8F7E6D5","B3A2","B5A6","F1E2D3","G8F7E6D5","B3","A2","","","","","","B5","A6","","","","","","D3","E2","F1","","","","","D5","E6","F7","G8","","",""]
["SLC5","SL","C",5,"C5B4A3","C5B6A7","G1F2E3D4","F8E7D6","B4A3","B6A7","G1F2E3D4","F8E7D6","B4","A3","","","","","","B6","A7","","","","","","D4","E3","F2","G1","","","","D6","E7","F8","","","",""]
["SLC6","SL","C",6,"C6B5A4","C6B7A8","H1G2F3E4D5","E8D7","B5A4","B7A8","H1G2F3E4D5","E8D7","B5","A4","","","","","","B7","A8","","","","","","D5","E4","F3","G2","H1","","","D7","E8","","","","",""]
["SLC7","SL","C",7,"C7B6A5","C7B8","H2G3F4E5D6","D8","B6A5","B8","H2G3F4E5D6","D8","B6","A5","","","","","","B8","","","","","","","D6","E5","F4","G3","H2","","","D8","","","","","",""]
["SLC8","SL","C",8,"C8B7A6","C8","H3G4F5E6D7","","B7A6","","H3G4F5E6D7","","B7","A6","","","","","","","","","","","","","D7","E6","F5","G4","H3","","","","","","","","",""]
["SLD1","SL","D",1,"D1","D1C2B3A4","","H5G4F3E2","","C2B3A4","","H5G4F3E2","","","","","","","","C2","B3","A4","","","","","","","","","","","","E2","F3","G4","H5","","",""]
[{"$f":"B91&C91&D91","v":"SLD2"},"SL","D",2,"D2C1","D2C3B4A5","E1","H6G5F4E3","C1","C3B4A5","E1","H6G5F4E3","C1","","","","","","","C3","B4","A5","","","","","E1","","","","","","","E3","F4","G5","H6","","",""]
[{"$f":"B92&C92&D92","v":"SLD3"},"SL","D",3,"D3C2B1","D3C4B5A6","F1E2","H7G6F5E4","C2B1","C4B5A6","F1E2","H7G6F5E4","C2","B1","","","","","","C4","B5","A6","","","","","E2","F1","","","","","","E4","F5","G6","H7","","",""]
["SLD4","SL","D",4,"D4C3B2A1","D4C5B6A7","G1F2E3","H8G7F6E5","C3B2A1","C5B6A7","G1F2E3","H8G7F6E5","C3","B2","A1","","","","","C5","B6","A7","","","","","E3","F2","G1","","","","","E5","F6","G7","H8","","",""]
["SLD5","SL","D",5,"D5C4B3A2","D5C6B7A8","H1G2F3E4","G8F7E6","C4B3A2","C6B7A8","H1G2F3E4","G8F7E6","C4","B3","A2","","","","","C6","B7","A8","","","","","E4","F3","G2","H1","","","","E6","F7","G8","","","",""]
["SLD6","SL","D",6,"D6C5B4A3","D6C7B8","H2G3F4E5","F8E7","C5B4A3","C7B8","H2G3F4E5","F8E7","C5","B4","A3","","","","","C7","B8","","","","","","E5","F4","G3","H2","","","","E7","F8","","","","",""]
["SLD7","SL","D",7,"D7C6B5A4","D7C8","H3G4F5E6","E8","C6B5A4","C8","H3G4F5E6","E8","C6","B5","A4","","","","","C8","","","","","","","E6","F5","G4","H3","","","","E8","","","","","",""]
["SLD8","SL","D",8,"D8C7B6A5","D8","H4G5F6E7","","C7B6A5","","H4G5F6E7","","C7","B6","A5","","","","","","","","","","","","E7","F6","G5","H4","","","","","","","","","",""]
["SLE1","SL","E",1,"E1","E1D2C3B4A5","","H4G3F2","","D2C3B4A5","","H4G3F2","","","","","","","","D2","C3","B4","A5","","","","","","","","","","","F2","G3","H4","","","",""]
["SLE2","SL","E",2,"E2D1","E2D3C4B5A6","F1","H5G4F3","D1","D3C4B5A6","F1","H5G4F3","D1","","","","","","","D3","C4","B5","A6","","","","F1","","","","","","","F3","G4","H5","","","",""]
["SLE3","SL","E",3,"E3D2C1","E3D4C5B6A7","G1F2","H6G5F4","D2C1","D4C5B6A7","G1F2","H6G5F4","D2","C1","","","","","","D4","C5","B6","A7","","","","F2","G1","","","","","","F4","G5","H6","","","",""]
["SLE4","SL","E",4,"E4D3C2B1","E4D5C6B7A8","H1G2F3","H7G6F5","D3C2B1","D5C6B7A8","H1G2F3","H7G6F5","D3","C2","B1","","","","","D5","C6","B7","A8","","","","F3","G2","H1","","","","","F5","G6","H7","","","",""]
["SLE5","SL","E",5,"E5D4C3B2A1","E5D6C7B8","H2G3F4","H8G7F6","D4C3B2A1","D6C7B8","H2G3F4","H8G7F6","D4","C3","B2","A1","","","","D6","C7","B8","","","","","F4","G3","H2","","","","","F6","G7","H8","","","",""]
["SLE6","SL","E",6,"E6D5C4B3A2","E6D7C8","H3G4F5","G8F7","D5C4B3A2","D7C8","H3G4F5","G8F7","D5","C4","B3","A2","","","","D7","C8","","","","","","F5","G4","H3","","","","","F7","G8","","","","",""]
["SLE7","SL","E",7,"E7D6C5B4A3","E7D8","H4G5F6","F8","D6C5B4A3","D8","H4G5F6","F8","D6","C5","B4","A3","","","","D8","","","","","","","F6","G5","H4","","","","","F8","","","","","",""]
["SLE8","SL","E",8,"E8D7C6B5A4","E8","H5G6F7","","D7C6B5A4","","H5G6F7","","D7","C6","B5","A4","","","","","","","","","","","F7","G6","H5","","","","","","","","","","",""]
["SLF1","SL","F",1,"F1","F1E2D3C4B5A6","","H3G2","","E2D3C4B5A6","","H3G2","","","","","","","","E2","D3","C4","B5","A6","","","","","","","","","","G2","H3","","","","",""]
["SLF2","SL","F",2,"F2E1","F2E3D4C5B6A7","G1","H4G3","E1","E3D4C5B6A7","G1","H4G3","E1","","","","","","","E3","D4","C5","B6","A7","","","G1","","","","","","","G3","H4","","","","",""]
["SLF3","SL","F",3,"F3E2D1","F3E4D5C6B7A8","H1G2","H5G4","E2D1","E4D5C6B7A8","H1G2","H5G4","E2","D1","","","","","","E4","D5","C6","B7","A8","","","G2","H1","","","","","","G4","H5","","","","",""]
["SLF4","SL","F",4,"F4E3D2C1","F4E5D6C7B8","H2G3","H6G5","E3D2C1","E5D6C7B8","H2G3","H6G5","E3","D2","C1","","","","","E5","D6","C7","B8","","","","G3","H2","","","","","","G5","H6","","","","",""]
["SLF5","SL","F",5,"F5E4D3C2B1","F5E6D7C8","H3G4","H7G6","E4D3C2B1","E6D7C8","H3G4","H7G6","E4","D3","C2","B1","","","","E6","D7","C8","","","","","G4","H3","","","","","","G6","H7","","","","",""]
["SLF6","SL","F",6,"F6E5D4C3B2A1","F6E7D8","H4G5","H8G7","E5D4C3B2A1","E7D8","H4G5","H8G7","E5","D4","C3","B2","A1","","","E7","D8","","","","","","G5","H4","","","","","","G7","H8","","","","",""]
["SLF7","SL","F",7,"F7E6D5C4B3A2","F7E8","H5G6","G8","E6D5C4B3A2","E8","H5G6","G8","E6","D5","C4","B3","A2","","","E8","","","","","","","G6","H5","","","","","","G8","","","","","",""]
["SLF8","SL","F",8,"F8E7D6C5B4A3","F8","H6G7","","E7D6C5B4A3","","H6G7","","E7","D6","C5","B4","A3","","","","","","","","","","G7","H6","","","","","","","","","","","",""]
["SLG1","SL","G",1,"G1","G1F2E3D4C5B6A7","","H2","","F2E3D4C5B6A7","","H2","","","","","","","","F2","E3","D4","C5","B6","A7","","","","","","","","","H2","","","","","",""]
["SLG2","SL","G",2,"G2F1","G2F3E4D5C6B7A8","H1","H3","F1","F3E4D5C6B7A8","H1","H3","F1","","","","","","","F3","E4","D5","C6","B7","A8","","H1","","","","","","","H3","","","","","",""]
["SLG3","SL","G",3,"G3F2E1","G3F4E5D6C7B8","H2","H4","F2E1","F4E5D6C7B8","H2","H4","F2","E1","","","","","","F4","E5","D6","C7","B8","","","H2","","","","","","","H4","","","","","",""]
["SLG4","SL","G",4,"G4F3E2D1","G4F5E6D7C8","H3","H5","F3E2D1","F5E6D7C8","H3","H5","F3","E2","D1","","","","","F5","E6","D7","C8","","","","H3","","","","","","","H5","","","","","",""]
["SLG5","SL","G",5,"G5F4E3D2C1","G5F6E7D8","H4","H6","F4E3D2C1","F6E7D8","H4","H6","F4","E3","D2","C1","","","","F6","E7","D8","","","","","H4","","","","","","","H6","","","","","",""]
["SLG6","SL","G",6,"G6F5E4D3C2B1","G6F7E8","H5","H7","F5E4D3C2B1","F7E8","H5","H7","F5","E4","D3","C2","B1","","","F7","E8","","","","","","H5","","","","","","","H7","","","","","",""]
["SLG7","SL","G",7,"G7F6E5D4C3B2A1","G7F8","H6","H8","F6E5D4C3B2A1","F8","H6","H8","F6","E5","D4","C3","B2","A1","","F8","","","","","","","H6","","","","","","","H8","","","","","",""]
["SLG8","SL","G",8,"G8F7E6D5C4B3A2","G8","H7","","F7E6D5C4B3A2","","H7","","F7","E6","D5","C4","B3","A2","","","","","","","","","H7","","","","","","","","","","","","",""]
["SLH1","SL","H",1,"H1","H1G2F3E4D5C6B7A8","","","","G2F3E4D5C6B7A8","","","","","","","","","","G2","F3","E4","D5","C6","B7","A8","","","","","","","","","","","","","",""]
[{"$f":"B123&C123&D123","v":"SLH2"},"SL","H",2,"H2G1","H2G3F4E5D6C7B8","","","G1","G3F4E5D6C7B8","","","G1","","","","","","","G3","F4","E5","D6","C7","B8","","","","","","","","","","","","","","",""]
[{"$f":"B124&C124&D124","v":"SLH3"},"SL","H",3,"H3G2F1","H3G4F5E6D7C8","","","G2F1","G4F5E6D7C8","","","G2","F1","","","","","","G4","F5","E6","D7","C8","","","","","","","","","","","","","","","",""]
["SLH4","SL","H",4,"H4G3F2E1","H4G5F6E7D8","","","G3F2E1","G5F6E7D8","","","G3","F2","E1","","","","","G5","F6","E7","D8","","","","","","","","","","","","","","","","",""]
["SLH5","SL","H",5,"H5G4F3E2D1","H5G6F7E8","","","G4F3E2D1","G6F7E8","","","G4","F3","E2","D1","","","","G6","F7","E8","","","","","","","","","","","","","","","","","",""]
["SLH6","SL","H",6,"H6G5F4E3D2C1","H6G7F8","","","G5F4E3D2C1","G7F8","","","G5","F4","E3","D2","C1","","","G7","F8","","","","","","","","","","","","","","","","","","",""]
["SLH7","SL","H",7,"H7G6F5E4D3C2B1","H7G8","","","G6F5E4D3C2B1","G8","","","G6","F5","E4","D3","C2","B1","","G8","","","","","","","","","","","","","","","","","","","",""]
["SLH8","SL","H",8,"H8G7F6E5D4C3B2A1","H8","","","G7F6E5D4C3B2A1","","","","G7","F6","E5","D4","C3","B2","A1","","","","","","","","","","","","","","","","","","","","",""]

{"sheet":"RVD","index":10,"n_rows":65,"n_cols":46,"rows_kept":65,"cut":false,"hidden":true,"merged":[]}
["Kombo","Pjäs","PosX","PosY","FlyttA","FlyttB","FlyttC","FlyttD","FlyttE","FlyttF","FlyttG","FlyttH","Flytt1","Flytt2","AttackA","AttackB","AttackC","AttackD"]
[{"$f":"B2&C2&D2","v":"VDA1"},"VD","A",1,{"$f":"$C2&$D2&O2","v":"A1"},{"$f":"C2&D2&P2","v":"A1"},{"$f":"Q2","v":""},{"$f":"R2","v":"H8G7F6E5D4C3B2"},{"$f":"LEFT(M2,FIND(C2&D2,M2)+1)","v":"A1"},{"$f":"RIGHT(M2,LEN(M2)-FIND(C2&D2,M2)-1)","v":"B1C1D1E1F1G1H1"},{"$f":"LEFT(N2,FIND(C2&D2,N2)+1)","v":"A1"},{"$f":"RIGHT(N2,LEN(N2)-FIND(C2&D2,N2)-1)","v":"A2A3A4A5A6A7A8"},{"$f":"\"A\"&D2&\"B\"&D2&\"C\"&D2&\"D\"&D2&\"E\"&D2&\"F\"&D2&\"G\"&D2&\"H\"&D2","v":"A1B1C1D1E1F1G1H1"},{"$f":"C2&\"1\"&C2&\"2\"&C2&\"3\"&C2&\"4\"&C2&\"5\"&C2&\"6\"&C2&\"7\"&C2&\"8\"","v":"A1A2A3A4A5A6A7A8"},{"$f":"CONCATENATE(S2,T2,U2,V2,W2,X2,Y2)","v":""},{"$f":"CONCATENATE(Z2,AA2,AB2,AC2,AD2,AE2,AF2)","v":""},{"$f":"CONCATENATE(AM2,AL2,AK2,AJ2,AI2,AH2,AG2)","v":""},{"$f":"CONCATENATE(AT2,AS2,AR2,AQ2,AP2,AO2,AN2)","v":"H8G7F6E5D4C3B2"},{"$f":"IF(AND($D2-1>0,CODE($C2)-1>64),CHAR(CODE($C2)-1)&$D2-1,\"\")","v":""},{"$f":"IF(AND($D2-2>0,CODE($C2)-2>64),CHAR(CODE($C2)-2)&$D2-2,\"\")","v":""},{"$f":"IF(AND($D2-3>0,CODE($C2)-3>64),CHAR(CODE($C2)-3)&$D2-3,\"\")","v":""},{"$f":"IF(AND($D2-4>0,CODE($C2)-4>64),CHAR(CODE($C2)-4)&$D2-4,\"\")","v":""},{"$f":"IF(AND($D2-5>0,CODE($C2)-5>64),CHAR(CODE($C2)-5)&$D2-5,\"\")","v":""},{"$f":"IF(AND($D2-6>0,CODE($C2)-6>64),CHAR(CODE($C2)-6)&$D2-6,\"\")","v":""},{"$f":"IF(AND($D2-7>0,CODE($C2)-7>64),CHAR(CODE($C2)-7)&$D2-7,\"\")","v":""},{"$f":"IF(AND($D2+1<9,CODE($C2)-1>64),CHAR(CODE($C2)-1)&$D2+1,\"\")","v":""},{"$f":"IF(AND($D2+2<9,CODE($C2)-2>64),CHAR(CODE($C2)-2)&$D2+2,\"\")","v":""},{"$f":"IF(AND($D2+3<9,CODE($C2)-3>64),CHAR(CODE($C2)-3)&$D2+3,\"\")","v":""},{"$f":"IF(AND($D2+4<9,CODE($C2)-4>64),CHAR(CODE($C2)-4)&$D2+4,\"\")","v":""},{"$f":"IF(AND($D2+5<9,CODE($C2)-5>64),CHAR(CODE($C2)-5)&$D2+5,\"\")","v":""},{"$f":"IF(AND($D2+6<9,CODE($C2)-6>64),CHAR(CODE($C2)-6)&$D2+6,\"\")","v":""},{"$f":"IF(AND($D2+7<9,CODE($C2)-7>64),CHAR(CODE($C2)-7)&$D2+7,\"\")","v":""},{"$f":"IF(AND($D2-1>0,CODE($C2)+1<73),CHAR(CODE($C2)+1)&$D2-1,\"\")","v":""},{"$f":"IF(AND($D2-2>0,CODE($C2)+2<73),CHAR(CODE($C2)+2)&$D2-2,\"\")","v":""},{"$f":"IF(AND($D2-3>0,CODE($C2)+3<73),CHAR(CODE($C2)+3)&$D2-3,\"\")","v":""},{"$f":"IF(AND($D2-4>0,CODE($C2)+4<73),CHAR(CODE($C2)+4)&$D2-4,\"\")","v":""},{"$f":"IF(AND($D2-5>0,CODE($C2)+5<73),CHAR(CODE($C2)+5)&$D2-5,\"\")","v":""},{"$f":"IF(AND($D2-6>0,CODE($C2)+6<73),CHAR(CODE($C2)+6)&$D2-6,\"\")","v":""},{"$f":"IF(AND($D2-7>0,CODE($C2)+7<73),CHAR(CODE($C2)+7)&$D2-7,\"\")","v":""},{"$f":"IF(AND($D2+1<9,CODE($C2)+1<73),CHAR(CODE($C2)+1)&$D2+1,\"\")","v":"B2"},{"$f":"IF(AND($D2+2<9,CODE($C2)+2<73),CHAR(CODE($C2)+2)&$D2+2,\"\")","v":"C3"},{"$f":"IF(AND($D2+3<9,CODE($C2)+3<73),CHAR(CODE($C2)+3)&$D2+3,\"\")","v":"D4"},{"$f":"IF(AND($D2+4<9,CODE($C2)+4<73),CHAR(CODE($C2)+4)&$D2+4,\"\")","v":"E5"},{"$f":"IF(AND($D2+5<9,CODE($C2)+5<73),CHAR(CODE($C2)+5)&$D2+5,\"\")","v":"F6"},{"$f":"IF(AND($D2+6<9,CODE($C2)+6<73),CHAR(CODE($C2)+6)&$D2+6,\"\")","v":"G7"},{"$f":"IF(AND($D2+7<9,CODE($C2)+7<73),CHAR(CODE($C2)+7)&$D2+7,\"\")","v":"H8"}]
[{"$f":"B3&C3&D3","v":"VDA2"},"VD","A",2,{"$f":"$C3&$D3&O3","v":"A2"},"A2","B1","G8F7E6D5C4B3",{"$f":"LEFT(M3,FIND(C3&D3,M3)+1)","v":"A2"},{"$f":"RIGHT(M3,LEN(M3)-FIND(C3&D3,M3)-1)","v":"B2C2D2E2F2G2H2"},{"$f":"LEFT(N3,FIND(C3&D3,N3)+1)","v":"A1A2"},{"$f":"RIGHT(N3,LEN(N3)-FIND(C3&D3,N3)-1)","v":"A3A4A5A6A7A8"},{"$f":"\"A\"&D3&\"B\"&D3&\"C\"&D3&\"D\"&D3&\"E\"&D3&\"F\"&D3&\"G\"&D3&\"H\"&D3","v":"A2B2C2D2E2F2G2H2"},{"$f":"C3&\"1\"&C3&\"2\"&C3&\"3\"&C3&\"4\"&C3&\"5\"&C3&\"6\"&C3&\"7\"&C3&\"8\"","v":"A1A2A3A4A5A6A7A8"},{"$f":"CONCATENATE(S3,T3,U3,V3,W3,X3,Y3)","v":""},{"$f":"CONCATENATE(Z3,AA3,AB3,AC3,AD3,AE3,AF3)","v":""},{"$f":"CONCATENATE(AM3,AL3,AK3,AJ3,AI3,AH3,AG3)","v":"B1"},{"$f":"CONCATENATE(AT3,AS3,AR3,AQ3,AP3,AO3,AN3)","v":"G8F7E6D5C4B3"},{"$f":"IF(AND($D3-1>0,CODE($C3)-1>64),CHAR(CODE($C3)-1)&$D3-1,\"\")","v":""},{"$f":"IF(AND($D3-2>0,CODE($C3)-2>64),CHAR(CODE($C3)-2)&$D3-2,\"\")","v":""},{"$f":"IF(AND($D3-3>0,CODE($C3)-3>64),CHAR(CODE($C3)-3)&$D3-3,\"\")","v":""},{"$f":"IF(AND($D3-4>0,CODE($C3)-4>64),CHAR(CODE($C3)-4)&$D3-4,\"\")","v":""},{"$f":"IF(AND($D3-5>0,CODE($C3)-5>64),CHAR(CODE($C3)-5)&$D3-5,\"\")","v":""},{"$f":"IF(AND($D3-6>0,CODE($C3)-6>64),CHAR(CODE($C3)-6)&$D3-6,\"\")","v":""},{"$f":"IF(AND($D3-7>0,CODE($C3)-7>64),CHAR(CODE($C3)-7)&$D3-7,\"\")","v":""},{"$f":"IF(AND($D3+1<9,CODE($C3)-1>64),CHAR(CODE($C3)-1)&$D3+1,\"\")","v":""},{"$f":"IF(AND($D3+2<9,CODE($C3)-2>64),CHAR(CODE($C3)-2)&$D3+2,\"\")","v":""},{"$f":"IF(AND($D3+3<9,CODE($C3)-3>64),CHAR(CODE($C3)-3)&$D3+3,\"\")","v":""},{"$f":"IF(AND($D3+4<9,CODE($C3)-4>64),CHAR(CODE($C3)-4)&$D3+4,\"\")","v":""},{"$f":"IF(AND($D3+5<9,CODE($C3)-5>64),CHAR(CODE($C3)-5)&$D3+5,\"\")","v":""},{"$f":"IF(AND($D3+6<9,CODE($C3)-6>64),CHAR(CODE($C3)-6)&$D3+6,\"\")","v":""},{"$f":"IF(AND($D3+7<9,CODE($C3)-7>64),CHAR(CODE($C3)-7)&$D3+7,\"\")","v":""},{"$f":"IF(AND($D3-1>0,CODE($C3)+1<73),CHAR(CODE($C3)+1)&$D3-1,\"\")","v":"B1"},{"$f":"IF(AND($D3-2>0,CODE($C3)+2<73),CHAR(CODE($C3)+2)&$D3-2,\"\")","v":""},{"$f":"IF(AND($D3-3>0,CODE($C3)+3<73),CHAR(CODE($C3)+3)&$D3-3,\"\")","v":""},{"$f":"IF(AND($D3-4>0,CODE($C3)+4<73),CHAR(CODE($C3)+4)&$D3-4,\"\")","v":""},{"$f":"IF(AND($D3-5>0,CODE($C3)+5<73),CHAR(CODE($C3)+5)&$D3-5,\"\")","v":""},{"$f":"IF(AND($D3-6>0,CODE($C3)+6<73),CHAR(CODE($C3)+6)&$D3-6,\"\")","v":""},{"$f":"IF(AND($D3-7>0,CODE($C3)+7<73),CHAR(CODE($C3)+7)&$D3-7,\"\")","v":""},{"$f":"IF(AND($D3+1<9,CODE($C3)+1<73),CHAR(CODE($C3)+1)&$D3+1,\"\")","v":"B3"},{"$f":"IF(AND($D3+2<9,CODE($C3)+2<73),CHAR(CODE($C3)+2)&$D3+2,\"\")","v":"C4"},{"$f":"IF(AND($D3+3<9,CODE($C3)+3<73),CHAR(CODE($C3)+3)&$D3+3,\"\")","v":"D5"},{"$f":"IF(AND($D3+4<9,CODE($C3)+4<73),CHAR(CODE($C3)+4)&$D3+4,\"\")","v":"E6"},{"$f":"IF(AND($D3+5<9,CODE($C3)+5<73),CHAR(CODE($C3)+5)&$D3+5,\"\")","v":"F7"},{"$f":"IF(AND($D3+6<9,CODE($C3)+6<73),CHAR(CODE($C3)+6)&$D3+6,\"\")","v":"G8"},{"$f":"IF(AND($D3+7<9,CODE($C3)+7<73),CHAR(CODE($C3)+7)&$D3+7,\"\")","v":""}]
["VDA3","VD","A",3,"A3","A3","C1B2","F8E7D6C5B4","A3","B3C3D3E3F3G3H3","A1A2A3","A4A5A6A7A8","A3B3C3D3E3F3G3H3","A1A2A3A4A5A6A7A8","","","C1B2","F8E7D6C5B4","","","","","","","","","","","","","","","B2","C1","","","","","","B4","C5","D6","E7","F8","",""]
["VDA4","VD","A",4,{"$f":"$C5&$D5&O5","v":"A4"},"A4","D1C2B3","E8D7C6B5","A4","B4C4D4E4F4G4H4","A1A2A3A4","A5A6A7A8","A4B4C4D4E4F4G4H4","A1A2A3A4A5A6A7A8","","","D1C2B3","E8D7C6B5","","","","","","","","","","","","","","","B3","C2","D1","","","","","B5","C6","D7","E8","","",""]
["VDA5","VD","A",5,"A5","A5","E1D2C3B4","D8C7B6","A5","B5C5D5E5F5G5H5","A1A2A3A4A5","A6A7A8","A5B5C5D5E5F5G5H5","A1A2A3A4A5A6A7A8","","","E1D2C3B4","D8C7B6","","","","","","","","","","","","","","","B4","C3","D2","E1","","","","B6","C7","D8","","","",""]
["VDA6","VD","A",6,"A6","A6","F1E2D3C4B5","C8B7","A6","B6C6D6E6F6G6H6","A1A2A3A4A5A6","A7A8","A6B6C6D6E6F6G6H6","A1A2A3A4A5A6A7A8","","","F1E2D3C4B5","C8B7","","","","","","","","","","","","","","","B5","C4","D3","E2","F1","","","B7","C8","","","","",""]
["VDA7","VD","A",7,"A7","A7","G1F2E3D4C5B6","B8","A7","B7C7D7E7F7G7H7","A1A2A3A4A5A6A7","A8","A7B7C7D7E7F7G7H7","A1A2A3A4A5A6A7A8","","","G1F2E3D4C5B6","B8","","","","","","","","","","","","","","","B6","C5","D4","E3","F2","G1","","B8","","","","","",""]
["VDA8","VD","A",8,"A8","A8","H1G2F3E4D5C6B7","","A8","B8C8D8E8F8G8H8","A1A2A3A4A5A6A7A8","","A8B8C8D8E8F8G8H8","A1A2A3A4A5A6A7A8","","","H1G2F3E4D5C6B7","","","","","","","","","","","","","","","","B7","C6","D5","E4","F3","G2","H1","","","","","","",""]
["VDB1","VD","B",1,"B1","B1A2","","H7G6F5E4D3C2","A1B1","C1D1E1F1G1H1","B1","B2B3B4B5B6B7B8","A1B1C1D1E1F1G1H1","B1B2B3B4B5B6B7B8","","A2","","H7G6F5E4D3C2","","","","","","","","A2","","","","","","","","","","","","","","C2","D3","E4","F5","G6","H7",""]
["VDB2","VD","B",2,"B2A1","B2A3","C1","H8G7F6E5D4C3","A2B2","C2D2E2F2G2H2","B1B2","B3B4B5B6B7B8","A2B2C2D2E2F2G2H2","B1B2B3B4B5B6B7B8","A1","A3","C1","H8G7F6E5D4C3","A1","","","","","","","A3","","","","","","","C1","","","","","","","C3","D4","E5","F6","G7","H8",""]
["VDB3","VD","B",3,"B3A2","B3A4","D1C2","G8F7E6D5C4","A3B3","C3D3E3F3G3H3","B1B2B3","B4B5B6B7B8","A3B3C3D3E3F3G3H3","B1B2B3B4B5B6B7B8","A2","A4","D1C2","G8F7E6D5C4","A2","","","","","","","A4","","","","","","","C2","D1","","","","","","C4","D5","E6","F7","G8","",""]
["VDB4","VD","B",4,"B4A3","B4A5","E1D2C3","F8E7D6C5","A4B4","C4D4E4F4G4H4","B1B2B3B4","B5B6B7B8","A4B4C4D4E4F4G4H4","B1B2B3B4B5B6B7B8","A3","A5","E1D2C3","F8E7D6C5","A3","","","","","","","A5","","","","","","","C3","D2","E1","","","","","C5","D6","E7","F8","","",""]
["VDB5","VD","B",5,"B5A4","B5A6","F1E2D3C4","E8D7C6","A5B5","C5D5E5F5G5H5","B1B2B3B4B5","B6B7B8","A5B5C5D5E5F5G5H5","B1B2B3B4B5B6B7B8","A4","A6","F1E2D3C4","E8D7C6","A4","","","","","","","A6","","","","","","","C4","D3","E2","F1","","","","C6","D7","E8","","","",""]
["VDB6","VD","B",6,"B6A5","B6A7","G1F2E3D4C5","D8C7","A6B6","C6D6E6F6G6H6","B1B2B3B4B5B6","B7B8","A6B6C6D6E6F6G6H6","B1B2B3B4B5B6B7B8","A5","A7","G1F2E3D4C5","D8C7","A5","","","","","","","A7","","","","","","","C5","D4","E3","F2","G1","","","C7","D8","","","","",""]
["VDB7","VD","B",7,"B7A6","B7A8","H1G2F3E4D5C6","C8","A7B7","C7D7E7F7G7H7","B1B2B3B4B5B6B7","B8","A7B7C7D7E7F7G7H7","B1B2B3B4B5B6B7B8","A6","A8","H1G2F3E4D5C6","C8","A6","","","","","","","A8","","","","","","","C6","D5","E4","F3","G2","H1","","C8","","","","","",""]
["VDB8","VD","B",8,"B8A7","B8","H2G3F4E5D6C7","","A8B8","C8D8E8F8G8H8","B1B2B3B4B5B6B7B8","","A8B8C8D8E8F8G8H8","B1B2B3B4B5B6B7B8","A7","","H2G3F4E5D6C7","","A7","","","","","","","","","","","","","","C7","D6","E5","F4","G3","H2","","","","","","","",""]
["VDC1","VD","C",1,"C1","C1B2A3","","H6G5F4E3D2","A1B1C1","D1E1F1G1H1","C1","C2C3C4C5C6C7C8","A1B1C1D1E1F1G1H1","C1C2C3C4C5C6C7C8","","B2A3","","H6G5F4E3D2","","","","","","","","B2","A3","","","","","","","","","","","","","D2","E3","F4","G5","H6","",""]
[{"$f":"B19&C19&D19","v":"VDC2"},"VD","C",2,"C2B1","C2B3A4","D1","H7G6F5E4D3","A2B2C2","D2E2F2G2H2","C1C2","C3C4C5C6C7C8","A2B2C2D2E2F2G2H2","C1C2C3C4C5C6C7C8","B1","B3A4","D1","H7G6F5E4D3","B1","","","","","","","B3","A4","","","","","","D1","","","","","","","D3","E4","F5","G6","H7","",""]
[{"$f":"B20&C20&D20","v":"VDC3"},"VD","C",3,"C3B2A1","C3B4A5","E1D2","H8G7F6E5D4","A3B3C3","D3E3F3G3H3","C1C2C3","C4C5C6C7C8","A3B3C3D3E3F3G3H3","C1C2C3C4C5C6C7C8","B2A1","B4A5","E1D2","H8G7F6E5D4","B2","A1","","","","","","B4","A5","","","","","","D2","E1","","","","","","D4","E5","F6","G7","H8","",""]
["VDC4","VD","C",4,"C4B3A2","C4B5A6","F1E2D3","G8F7E6D5","A4B4C4","D4E4F4G4H4","C1C2C3C4","C5C6C7C8","A4B4C4D4E4F4G4H4","C1C2C3C4C5C6C7C8","B3A2","B5A6","F1E2D3","G8F7E6D5","B3","A2","","","","","","B5","A6","","","","","","D3","E2","F1","","","","","D5","E6","F7","G8","","",""]
["VDC5","VD","C",5,"C5B4A3","C5B6A7","G1F2E3D4","F8E7D6","A5B5C5","D5E5F5G5H5","C1C2C3C4C5","C6C7C8","A5B5C5D5E5F5G5H5","C1C2C3C4C5C6C7C8","B4A3","B6A7","G1F2E3D4","F8E7D6","B4","A3","","","","","","B6","A7","","","","","","D4","E3","F2","G1","","","","D6","E7","F8","","","",""]
["VDC6","VD","C",6,"C6B5A4","C6B7A8","H1G2F3E4D5","E8D7","A6B6C6","D6E6F6G6H6","C1C2C3C4C5C6","C7C8","A6B6C6D6E6F6G6H6","C1C2C3C4C5C6C7C8","B5A4","B7A8","H1G2F3E4D5","E8D7","B5","A4","","","","","","B7","A8","","","","","","D5","E4","F3","G2","H1","","","D7","E8","","","","",""]
["VDC7","VD","C",7,"C7B6A5","C7B8","H2G3F4E5D6","D8","A7B7C7","D7E7F7G7H7","C1C2C3C4C5C6C7","C8","A7B7C7D7E7F7G7H7","C1C2C3C4C5C6C7C8","B6A5","B8","H2G3F4E5D6","D8","B6","A5","","","","","","B8","","","","","","","D6","E5","F4","G3","H2","","","D8","","","","","",""]
["VDC8","VD","C",8,"C8B7A6","C8","H3G4F5E6D7","","A8B8C8","D8E8F8G8H8","C1C2C3C4C5C6C7C8","","A8B8C8D8E8F8G8H8","C1C2C3C4C5C6C7C8","B7A6","","H3G4F5E6D7","","B7","A6","","","","","","","","","","","","","D7","E6","F5","G4","H3","","","","","","","","",""]
["VDD1","VD","D",1,"D1","D1C2B3A4","","H5G4F3E2","A1B1C1D1","E1F1G1H1","D1","D2D3D4D5D6D7D8","A1B1C1D1E1F1G1H1","D1D2D3D4D5D6D7D8","","C2B3A4","","H5G4F3E2","","","","","","","","C2","B3","A4","","","","","","","","","","","","E2","F3","G4","H5","","",""]
[{"$f":"B27&C27&D27","v":"VDD2"},"VD","D",2,"D2C1","D2C3B4A5","E1","H6G5F4E3","A2B2C2D2","E2F2G2H2","D1D2","D3D4D5D6D7D8","A2B2C2D2E2F2G2H2","D1D2D3D4D5D6D7D8","C1","C3B4A5","E1","H6G5F4E3","C1","","","","","","","C3","B4","A5","","","","","E1","","","","","","","E3","F4","G5","H6","","",""]
[{"$f":"B28&C28&D28","v":"VDD3"},"VD","D",3,"D3C2B1","D3C4B5A6","F1E2","H7G6F5E4","A3B3C3D3","E3F3G3H3","D1D2D3","D4D5D6D7D8","A3B3C3D3E3F3G3H3","D1D2D3D4D5D6D7D8","C2B1","C4B5A6","F1E2","H7G6F5E4","C2","B1","","","","","","C4","B5","A6","","","","","E2","F1","","","","","","E4","F5","G6","H7","","",""]
["VDD4","VD","D",4,"D4C3B2A1","D4C5B6A7","G1F2E3","H8G7F6E5","A4B4C4D4","E4F4G4H4","D1D2D3D4","D5D6D7D8","A4B4C4D4E4F4G4H4","D1D2D3D4D5D6D7D8","C3B2A1","C5B6A7","G1F2E3","H8G7F6E5","C3","B2","A1","","","","","C5","B6","A7","","","","","E3","F2","G1","","","","","E5","F6","G7","H8","","",""]
["VDD5","VD","D",5,"D5C4B3A2","D5C6B7A8","H1G2F3E4","G8F7E6","A5B5C5D5","E5F5G5H5","D1D2D3D4D5","D6D7D8","A5B5C5D5E5F5G5H5","D1D2D3D4D5D6D7D8","C4B3A2","C6B7A8","H1G2F3E4","G8F7E6","C4","B3","A2","","","","","C6","B7","A8","","","","","E4","F3","G2","H1","","","","E6","F7","G8","","","",""]
["VDD6","VD","D",6,"D6C5B4A3","D6C7B8","H2G3F4E5","F8E7","A6B6C6D6","E6F6G6H6","D1D2D3D4D5D6","D7D8","A6B6C6D6E6F6G6H6","D1D2D3D4D5D6D7D8","C5B4A3","C7B8","H2G3F4E5","F8E7","C5","B4","A3","","","","","C7","B8","","","","","","E5","F4","G3","H2","","","","E7","F8","","","","",""]
["VDD7","VD","D",7,"D7C6B5A4","D7C8","H3G4F5E6","E8","A7B7C7D7","E7F7G7H7","D1D2D3D4D5D6D7","D8","A7B7C7D7E7F7G7H7","D1D2D3D4D5D6D7D8","C6B5A4","C8","H3G4F5E6","E8","C6","B5","A4","","","","","C8","","","","","","","E6","F5","G4","H3","","","","E8","","","","","",""]
["VDD8","VD","D",8,"D8C7B6A5","D8","H4G5F6E7","","A8B8C8D8","E8F8G8H8","D1D2D3D4D5D6D7D8","","A8B8C8D8E8F8G8H8","D1D2D3D4D5D6D7D8","C7B6A5","","H4G5F6E7","","C7","B6","A5","","","","","","","","","","","","E7","F6","G5","H4","","","","","","","","","",""]
["VDE1","VD","E",1,"E1",{"$f":"C34&D34&P34","v":"E1D2C3B4A5"},{"$f":"Q34","v":""},{"$f":"R34","v":"H4G3F2"},"A1B1C1D1E1","F1G1H1","E1","E2E3E4E5E6E7E8","A1B1C1D1E1F1G1H1","E1E2E3E4E5E6E7E8","","D2C3B4A5","","H4G3F2","","","","","","","","D2","C3","B4","A5","","","","","","","","","","","F2","G3","H4","","","",""]
["VDE2","VD","E",2,"E2D1","E2D3C4B5A6","F1","H5G4F3","A2B2C2D2E2","F2G2H2","E1E2","E3E4E5E6E7E8","A2B2C2D2E2F2G2H2","E1E2E3E4E5E6E7E8","D1","D3C4B5A6","F1","H5G4F3","D1","","","","","","","D3","C4","B5","A6","","","","F1","","","","","","","F3","G4","H5","","","",""]
["VDE3","VD","E",3,"E3D2C1","E3D4C5B6A7","G1F2","H6G5F4","A3B3C3D3E3","F3G3H3","E1E2E3","E4E5E6E7E8","A3B3C3D3E3F3G3H3","E1E2E3E4E5E6E7E8","D2C1","D4C5B6A7","G1F2","H6G5F4","D2","C1","","","","","","D4","C5","B6","A7","","","","F2","G1","","","","","","F4","G5","H6","","","",""]
["VDE4","VD","E",4,{"$f":"$C37&$D37&O37","v":"E4D3C2B1"},"E4D5C6B7A8","H1G2F3","H7G6F5","A4B4C4D4E4","F4G4H4","E1E2E3E4","E5E6E7E8","A4B4C4D4E4F4G4H4","E1E2E3E4E5E6E7E8","D3C2B1","D5C6B7A8","H1G2F3","H7G6F5","D3","C2","B1","","","","","D5","C6","B7","A8","","","","F3","G2","H1","","","","","F5","G6","H7","","","",""]
["VDE5","VD","E",5,"E5D4C3B2A1","E5D6C7B8","H2G3F4","H8G7F6","A5B5C5D5E5","F5G5H5","E1E2E3E4E5","E6E7E8","A5B5C5D5E5F5G5H5","E1E2E3E4E5E6E7E8","D4C3B2A1","D6C7B8","H2G3F4","H8G7F6","D4","C3","B2","A1","","","","D6","C7","B8","","","","","F4","G3","H2","","","","","F6","G7","H8","","","",""]
["VDE6","VD","E",6,"E6D5C4B3A2","E6D7C8","H3G4F5","G8F7","A6B6C6D6E6","F6G6H6","E1E2E3E4E5E6","E7E8","A6B6C6D6E6F6G6H6","E1E2E3E4E5E6E7E8","D5C4B3A2","D7C8","H3G4F5","G8F7","D5","C4","B3","A2","","","","D7","C8","","","","","","F5","G4","H3","","","","","F7","G8","","","","",""]
["VDE7","VD","E",7,"E7D6C5B4A3","E7D8","H4G5F6","F8","A7B7C7D7E7","F7G7H7","E1E2E3E4E5E6E7","E8","A7B7C7D7E7F7G7H7","E1E2E3E4E5E6E7E8","D6C5B4A3","D8","H4G5F6","F8","D6","C5","B4","A3","","","","D8","","","","","","","F6","G5","H4","","","","","F8","","","","","",""]
["VDE8","VD","E",8,"E8D7C6B5A4","E8","H5G6F7","","A8B8C8D8E8","F8G8H8","E1E2E3E4E5E6E7E8","","A8B8C8D8E8F8G8H8","E1E2E3E4E5E6E7E8","D7C6B5A4","","H5G6F7","","D7","C6","B5","A4","","","","","","","","","","","F7","G6","H5","","","","","","","","","","",""]
["VDF1","VD","F",1,"F1","F1E2D3C4B5A6","","H3G2","A1B1C1D1E1F1","G1H1","F1","F2F3F4F5F6F7F8","A1B1C1D1E1F1G1H1","F1F2F3F4F5F6F7F8","","E2D3C4B5A6","","H3G2","","","","","","","","E2","D3","C4","B5","A6","","","","","","","","","","G2","H3","","","","",""]
["VDF2","VD","F",2,"F2E1","F2E3D4C5B6A7","G1","H4G3","A2B2C2D2E2F2","G2H2","F1F2","F3F4F5F6F7F8","A2B2C2D2E2F2G2H2","F1F2F3F4F5F6F7F8","E1","E3D4C5B6A7","G1","H4G3","E1","","","","","","","E3","D4","C5","B6","A7","","","G1","","","","","","","G3","H4","","","","",""]
["VDF3","VD","F",3,"F3E2D1","F3E4D5C6B7A8","H1G2","H5G4","A3B3C3D3E3F3","G3H3","F1F2F3","F4F5F6F7F8","A3B3C3D3E3F3G3H3","F1F2F3F4F5F6F7F8","E2D1","E4D5C6B7A8","H1G2","H5G4","E2","D1","","","","","","E4","D5","C6","B7","A8","","","G2","H1","","","","","","G4","H5","","","","",""]
["VDF4","VD","F",4,"F4E3D2C1","F4E5D6C7B8","H2G3","H6G5","A4B4C4D4E4F4","G4H4","F1F2F3F4","F5F6F7F8","A4B4C4D4E4F4G4H4","F1F2F3F4F5F6F7F8","E3D2C1","E5D6C7B8","H2G3","H6G5","E3","D2","C1","","","","","E5","D6","C7","B8","","","","G3","H2","","","","","","G5","H6","","","","",""]
["VDF5","VD","F",5,"F5E4D3C2B1","F5E6D7C8","H3G4","H7G6","A5B5C5D5E5F5","G5H5","F1F2F3F4F5","F6F7F8","A5B5C5D5E5F5G5H5","F1F2F3F4F5F6F7F8","E4D3C2B1","E6D7C8","H3G4","H7G6","E4","D3","C2","B1","","","","E6","D7","C8","","","","","G4","H3","","","","","","G6","H7","","","","",""]
["VDF6","VD","F",6,"F6E5D4C3B2A1","F6E7D8","H4G5","H8G7","A6B6C6D6E6F6","G6H6","F1F2F3F4F5F6","F7F8","A6B6C6D6E6F6G6H6","F1F2F3F4F5F6F7F8","E5D4C3B2A1","E7D8","H4G5","H8G7","E5","D4","C3","B2","A1","","","E7","D8","","","","","","G5","H4","","","","","","G7","H8","","","","",""]
["VDF7","VD","F",7,"F7E6D5C4B3A2","F7E8","H5G6","G8","A7B7C7D7E7F7","G7H7","F1F2F3F4F5F6F7","F8","A7B7C7D7E7F7G7H7","F1F2F3F4F5F6F7F8","E6D5C4B3A2","E8","H5G6","G8","E6","D5","C4","B3","A2","","","E8","","","","","","","G6","H5","","","","","","G8","","","","","",""]
["VDF8","VD","F",8,"F8E7D6C5B4A3","F8","H6G7","","A8B8C8D8E8F8","G8H8","F1F2F3F4F5F6F7F8","","A8B8C8D8E8F8G8H8","F1F2F3F4F5F6F7F8","E7D6C5B4A3","","H6G7","","E7","D6","C5","B4","A3","","","","","","","","","","G7","H6","","","","","","","","","","","",""]
["VDG1","VD","G",1,"G1","G1F2E3D4C5B6A7","","H2","A1B1C1D1E1F1G1","H1","G1","G2G3G4G5G6G7G8","A1B1C1D1E1F1G1H1","G1G2G3G4G5G6G7G8","","F2E3D4C5B6A7","","H2","","","","","","","","F2","E3","D4","C5","B6","A7","","","","","","","","","H2","","","","","",""]
["VDG2","VD","G",2,"G2F1","G2F3E4D5C6B7A8","H1","H3","A2B2C2D2E2F2G2","H2","G1G2","G3G4G5G6G7G8","A2B2C2D2E2F2G2H2","G1G2G3G4G5G6G7G8","F1","F3E4D5C6B7A8","H1","H3","F1","","","","","","","F3","E4","D5","C6","B7","A8","","H1","","","","","","","H3","","","","","",""]
["VDG3","VD","G",3,"G3F2E1","G3F4E5D6C7B8","H2","H4","A3B3C3D3E3F3G3","H3","G1G2G3","G4G5G6G7G8","A3B3C3D3E3F3G3H3","G1G2G3G4G5G6G7G8","F2E1","F4E5D6C7B8","H2","H4","F2","E1","","","","","","F4","E5","D6","C7","B8","","","H2","","","","","","","H4","","","","","",""]
["VDG4","VD","G",4,"G4F3E2D1","G4F5E6D7C8","H3","H5","A4B4C4D4E4F4G4","H4","G1G2G3G4","G5G6G7G8","A4B4C4D4E4F4G4H4","G1G2G3G4G5G6G7G8","F3E2D1","F5E6D7C8","H3","H5","F3","E2","D1","","","","","F5","E6","D7","C8","","","","H3","","","","","","","H5","","","","","",""]
["VDG5","VD","G",5,"G5F4E3D2C1","G5F6E7D8","H4","H6","A5B5C5D5E5F5G5","H5","G1G2G3G4G5","G6G7G8","A5B5C5D5E5F5G5H5","G1G2G3G4G5G6G7G8","F4E3D2C1","F6E7D8","H4","H6","F4","E3","D2","C1","","","","F6","E7","D8","","","","","H4","","","","","","","H6","","","","","",""]
["VDG6","VD","G",6,"G6F5E4D3C2B1","G6F7E8","H5","H7","A6B6C6D6E6F6G6","H6","G1G2G3G4G5G6","G7G8","A6B6C6D6E6F6G6H6","G1G2G3G4G5G6G7G8","F5E4D3C2B1","F7E8","H5","H7","F5","E4","D3","C2","B1","","","F7","E8","","","","","","H5","","","","","","","H7","","","","","",""]
["VDG7","VD","G",7,"G7F6E5D4C3B2A1","G7F8","H6","H8","A7B7C7D7E7F7G7","H7","G1G2G3G4G5G6G7","G8","A7B7C7D7E7F7G7H7","G1G2G3G4G5G6G7G8","F6E5D4C3B2A1","F8","H6","H8","F6","E5","D4","C3","B2","A1","","F8","","","","","","","H6","","","","","","","H8","","","","","",""]
["VDG8","VD","G",8,"G8F7E6D5C4B3A2","G8","H7","","A8B8C8D8E8F8G8","H8","G1G2G3G4G5G6G7G8","","A8B8C8D8E8F8G8H8","G1G2G3G4G5G6G7G8","F7E6D5C4B3A2","","H7","","F7","E6","D5","C4","B3","A2","","","","","","","","","H7","","","","","","","","","","","","",""]
["VDH1","VD","H",1,"H1","H1G2F3E4D5C6B7A8","","","A1B1C1D1E1F1G1H1","","H1","H2H3H4H5H6H7H8","A1B1C1D1E1F1G1H1","H1H2H3H4H5H6H7H8","","G2F3E4D5C6B7A8","","","","","","","","","","G2","F3","E4","D5","C6","B7","A8","","","","","","","","","","","","","",""]
[{"$f":"B59&C59&D59","v":"VDH2"},"VD","H",2,"H2G1","H2G3F4E5D6C7B8","","","A2B2C2D2E2F2G2H2","","H1H2","H3H4H5H6H7H8","A2B2C2D2E2F2G2H2","H1H2H3H4H5H6H7H8","G1","G3F4E5D6C7B8","","","G1","","","","","","","G3","F4","E5","D6","C7","B8","","","","","","","","","","","","","","",""]
[{"$f":"B60&C60&D60","v":"VDH3"},"VD","H",3,"H3G2F1","H3G4F5E6D7C8","","","A3B3C3D3E3F3G3H3","","H1H2H3","H4H5H6H7H8","A3B3C3D3E3F3G3H3","H1H2H3H4H5H6H7H8","G2F1","G4F5E6D7C8","","","G2","F1","","","","","","G4","F5","E6","D7","C8","","","","","","","","","","","","","","","",""]
["VDH4","VD","H",4,"H4G3F2E1","H4G5F6E7D8","","","A4B4C4D4E4F4G4H4","","H1H2H3H4","H5H6H7H8","A4B4C4D4E4F4G4H4","H1H2H3H4H5H6H7H8","G3F2E1","G5F6E7D8","","","G3","F2","E1","","","","","G5","F6","E7","D8","","","","","","","","","","","","","","","","",""]
["VDH5","VD","H",5,"H5G4F3E2D1","H5G6F7E8","","","A5B5C5D5E5F5G5H5","","H1H2H3H4H5","H6H7H8","A5B5C5D5E5F5G5H5","H1H2H3H4H5H6H7H8","G4F3E2D1","G6F7E8","","","G4","F3","E2","D1","","","","G6","F7","E8","","","","","","","","","","","","","","","","","",""]
["VDH6","VD","H",6,"H6G5F4E3D2C1","H6G7F8","","","A6B6C6D6E6F6G6H6","","H1H2H3H4H5H6","H7H8","A6B6C6D6E6F6G6H6","H1H2H3H4H5H6H7H8","G5F4E3D2C1","G7F8","","","G5","F4","E3","D2","C1","","","G7","F8","","","","","","","","","","","","","","","","","","",""]
["VDH7","VD","H",7,"H7G6F5E4D3C2B1","H7G8","","","A7B7C7D7E7F7G7H7","","H1H2H3H4H5H6H7","H8","A7B7C7D7E7F7G7H7","H1H2H3H4H5H6H7H8","G6F5E4D3C2B1","G8","","","G6","F5","E4","D3","C2","B1","","G8","","","","","","","","","","","","","","","","","","","",""]
["VDH8","VD","H",8,"H8G7F6E5D4C3B2A1","H8","","","A8B8C8D8E8F8G8H8","","H1H2H3H4H5H6H7H8","","A8B8C8D8E8F8G8H8","H1H2H3H4H5H6H7H8","G7F6E5D4C3B2A1","","","","G7","F6","E5","D4","C3","B2","A1","","","","","","","","","","","","","","","","","","","","",""]

{"sheet":"RVK","index":11,"n_rows":65,"n_cols":13,"rows_kept":65,"cut":false,"hidden":true,"merged":[]}
["Kombo","Pjäs","PosX","PosY","Flytt","Upp","HögerUpp","Höger","HögerNed","Ned","VänsterNed","Vänster","VänsterUpp"]
[{"$f":"B2&C2&D2","v":"VKA1"},"VK","A",1,{"$f":"C2&D2&F2&G2&H2&I2&J2&K2&L2&M2","v":"A1B1B2A2"},{"$f":"IF(AND($D2-1>0),C2&$D2-1,\"\")","v":""},{"$f":"IF(AND($D2-1>0,CODE($C2)+1<73),CHAR(CODE($C2)+1)&$D2-1,\"\")","v":""},{"$f":"IF(AND(CODE($C2)+1<73),CHAR(CODE($C2)+1)&$D2,\"\")","v":"B1"},{"$f":"IF(AND($D2+1<9,CODE($C2)+1<73),CHAR(CODE($C2)+1)&$D2+1,\"\")","v":"B2"},{"$f":"IF(AND($D2+1<9),C2&$D2+1,\"\")","v":"A2"},{"$f":"IF(AND($D2+1<9,CODE($C2)-1>64),CHAR(CODE($C2)-1)&$D2+1,\"\")","v":""},{"$f":"IF(AND(CODE($C2)-1>64),CHAR(CODE($C2)-1)&$D2,\"\")","v":""},{"$f":"IF(AND($D2-1>0,CODE($C2)-1>64),CHAR(CODE($C2)-1)&$D2-1,\"\")","v":""}]
[{"$f":"B3&C3&D3","v":"VKA2"},"VK","A",2,{"$f":"C3&D3&F3&G3&H3&I3&J3&K3&L3&M3","v":"A2A1B1B2B3A3"},{"$f":"IF(AND($D3-1>0),C3&$D3-1,\"\")","v":"A1"},{"$f":"IF(AND($D3-1>0,CODE($C3)+1<73),CHAR(CODE($C3)+1)&$D3-1,\"\")","v":"B1"},{"$f":"IF(AND(CODE($C3)+1<73),CHAR(CODE($C3)+1)&$D3,\"\")","v":"B2"},{"$f":"IF(AND($D3+1<9,CODE($C3)+1<73),CHAR(CODE($C3)+1)&$D3+1,\"\")","v":"B3"},{"$f":"IF(AND($D3+1<9),C3&$D3+1,\"\")","v":"A3"},{"$f":"IF(AND($D3+1<9,CODE($C3)-1>64),CHAR(CODE($C3)-1)&$D3+1,\"\")","v":""},{"$f":"IF(AND(CODE($C3)-1>64),CHAR(CODE($C3)-1)&$D3,\"\")","v":""},{"$f":"IF(AND($D3-1>0,CODE($C3)-1>64),CHAR(CODE($C3)-1)&$D3-1,\"\")","v":""}]
["VKA3","VK","A",3,"A3A2B2B3B4A4","A2","B2","B3","B4","A4","","",""]
["VKA4","VK","A",4,"A4A3B3B4B5A5","A3","B3","B4","B5","A5","","",""]
["VKA5","VK","A",5,"A5A4B4B5B6A6","A4","B4","B5","B6","A6","","",""]
["VKA6","VK","A",6,"A6A5B5B6B7A7","A5","B5","B6","B7","A7","","",""]
["VKA7","VK","A",7,"A7A6B6B7B8A8","A6","B6","B7","B8","A8","","",""]
["VKA8","VK","A",8,"A8A7B7B8","A7","B7","B8","","","","",""]
["VKB1","VK","B",1,"B1C1C2B2A2A1","","","C1","C2","B2","A2","A1",""]
["VKB2","VK","B",2,"B2B1C1C2C3B3A3A2A1","B1","C1","C2","C3","B3","A3","A2","A1"]
["VKB3","VK","B",3,"B3B2C2C3C4B4A4A3A2","B2","C2","C3","C4","B4","A4","A3","A2"]
["VKB4","VK","B",4,"B4B3C3C4C5B5A5A4A3","B3","C3","C4","C5","B5","A5","A4","A3"]
["VKB5","VK","B",5,"B5B4C4C5C6B6A6A5A4","B4","C4","C5","C6","B6","A6","A5","A4"]
["VKB6","VK","B",6,"B6B5C5C6C7B7A7A6A5","B5","C5","C6","C7","B7","A7","A6","A5"]
["VKB7","VK","B",7,"B7B6C6C7C8B8A8A7A6","B6","C6","C7","C8","B8","A8","A7","A6"]
["VKB8","VK","B",8,"B8B7C7C8A8A7","B7","C7","C8","","","","A8","A7"]
["VKC1","VK","C",1,"C1D1D2C2B2B1","","","D1","D2","C2","B2","B1",""]
[{"$f":"B19&C19&D19","v":"VKC2"},"VK","C",2,"C2C1D1D2D3C3B3B2B1","C1","D1","D2","D3","C3","B3","B2","B1"]
[{"$f":"B20&C20&D20","v":"VKC3"},"VK","C",3,"C3C2D2D3D4C4B4B3B2","C2","D2","D3","D4","C4","B4","B3","B2"]
["VKC4","VK","C",4,"C4C3D3D4D5C5B5B4B3","C3","D3","D4","D5","C5","B5","B4","B3"]
["VKC5","VK","C",5,"C5C4D4D5D6C6B6B5B4","C4","D4","D5","D6","C6","B6","B5","B4"]
["VKC6","VK","C",6,"C6C5D5D6D7C7B7B6B5","C5","D5","D6","D7","C7","B7","B6","B5"]
["VKC7","VK","C",7,"C7C6D6D7D8C8B8B7B6","C6","D6","D7","D8","C8","B8","B7","B6"]
["VKC8","VK","C",8,"C8C7D7D8B8B7","C7","D7","D8","","","","B8","B7"]
["VKD1","VK","D",1,"D1E1E2D2C2C1","","","E1","E2","D2","C2","C1",""]
[{"$f":"B27&C27&D27","v":"VKD2"},"VK","D",2,"D2D1E1E2E3D3C3C2C1","D1","E1","E2","E3","D3","C3","C2","C1"]
[{"$f":"B28&C28&D28","v":"VKD3"},"VK","D",3,"D3D2E2E3E4D4C4C3C2","D2","E2","E3","E4","D4","C4","C3","C2"]
["VKD4","VK","D",4,"D4D3E3E4E5D5C5C4C3","D3","E3","E4","E5","D5","C5","C4","C3"]
["VKD5","VK","D",5,"D5D4E4E5E6D6C6C5C4","D4","E4","E5","E6","D6","C6","C5","C4"]
["VKD6","VK","D",6,"D6D5E5E6E7D7C7C6C5","D5","E5","E6","E7","D7","C7","C6","C5"]
["VKD7","VK","D",7,"D7D6E6E7E8D8C8C7C6","D6","E6","E7","E8","D8","C8","C7","C6"]
["VKD8","VK","D",8,"D8D7E7E8C8C7","D7","E7","E8","","","","C8","C7"]
["VKE1","VK","E",1,"E1F1F2E2D2D1","","","F1","F2","E2","D2","D1",""]
["VKE2","VK","E",2,"E2E1F1F2F3E3D3D2D1","E1","F1","F2","F3","E3","D3","D2","D1"]
["VKE3","VK","E",3,"E3E2F2F3F4E4D4D3D2","E2","F2","F3","F4","E4","D4","D3","D2"]
["VKE4","VK","E",4,"E4E3F3F4F5E5D5D4D3","E3","F3","F4","F5","E5","D5","D4","D3"]
["VKE5","VK","E",5,"E5E4F4F5F6E6D6D5D4","E4","F4","F5","F6","E6","D6","D5","D4"]
["VKE6","VK","E",6,"E6E5F5F6F7E7D7D6D5","E5","F5","F6","F7","E7","D7","D6","D5"]
["VKE7","VK","E",7,"E7E6F6F7F8E8D8D7D6","E6","F6","F7","F8","E8","D8","D7","D6"]
["VKE8","VK","E",8,"E8E7F7F8D8D7","E7","F7","F8","","","","D8","D7"]
["VKF1","VK","F",1,"F1G1G2F2E2E1","","","G1","G2","F2","E2","E1",""]
["VKF2","VK","F",2,"F2F1G1G2G3F3E3E2E1","F1","G1","G2","G3","F3","E3","E2","E1"]
["VKF3","VK","F",3,"F3F2G2G3G4F4E4E3E2","F2","G2","G3","G4","F4","E4","E3","E2"]
["VKF4","VK","F",4,"F4F3G3G4G5F5E5E4E3","F3","G3","G4","G5","F5","E5","E4","E3"]
["VKF5","VK","F",5,"F5F4G4G5G6F6E6E5E4","F4","G4","G5","G6","F6","E6","E5","E4"]
["VKF6","VK","F",6,"F6F5G5G6G7F7E7E6E5","F5","G5","G6","G7","F7","E7","E6","E5"]
["VKF7","VK","F",7,"F7F6G6G7G8F8E8E7E6","F6","G6","G7","G8","F8","E8","E7","E6"]
["VKF8","VK","F",8,"F8F7G7G8E8E7","F7","G7","G8","","","","E8","E7"]
["VKG1","VK","G",1,"G1H1H2G2F2F1","","","H1","H2","G2","F2","F1",""]
["VKG2","VK","G",2,"G2G1H1H2H3G3F3F2F1","G1","H1","H2","H3","G3","F3","F2","F1"]
["VKG3","VK","G",3,"G3G2H2H3H4G4F4F3F2","G2","H2","H3","H4","G4","F4","F3","F2"]
["VKG4","VK","G",4,"G4G3H3H4H5G5F5F4F3","G3","H3","H4","H5","G5","F5","F4","F3"]
["VKG5","VK","G",5,"G5G4H4H5H6G6F6F5F4","G4","H4","H5","H6","G6","F6","F5","F4"]
["VKG6","VK","G",6,"G6G5H5H6H7G7F7F6F5","G5","H5","H6","H7","G7","F7","F6","F5"]
["VKG7","VK","G",7,"G7G6H6H7H8G8F8F7F6","G6","H6","H7","H8","G8","F8","F7","F6"]
["VKG8","VK","G",8,"G8G7H7H8F8F7","G7","H7","H8","","","","F8","F7"]
["VKH1","VK","H",1,"H1H2G2G1","","","","","H2","G2","G1",""]
[{"$f":"B59&C59&D59","v":"VKH2"},"VK","H",2,"H2H1H3G3G2G1","H1","","","","H3","G3","G2","G1"]
[{"$f":"B60&C60&D60","v":"VKH3"},"VK","H",3,"H3H2H4G4G3G2","H2","","","","H4","G4","G3","G2"]
["VKH4","VK","H",4,"H4H3H5G5G4G3","H3","","","","H5","G5","G4","G3"]
["VKH5","VK","H",5,"H5H4H6G6G5G4","H4","","","","H6","G6","G5","G4"]
["VKH6","VK","H",6,"H6H5H7G7G6G5","H5","","","","H7","G7","G6","G5"]
["VKH7","VK","H",7,"H7H6H8G8G7G6","H6","","","","H8","G8","G7","G6"]
["VKH8","VK","H",8,"H8H7G8G7","H7","","","","","","G8","G7"]

{"sheet":"RVS","index":12,"n_rows":65,"n_cols":13,"rows_kept":65,"cut":false,"hidden":true,"merged":[]}
["Kombo","Pjäs","PosX","PosY","Flytt","Flytt1","Flytt2","Flytt3","Flytt4","Flytt5","Flytt6","Flytt7","Flytt8"]
[{"$f":"B2&C2&D2","v":"VSA1"},"VS","A",1,{"$f":"CONCATENATE(C2&D2,F2,G2,H2,I2,J2,K2,L2,M2)","v":"A1B3C2"},{"$f":"IF(AND($D2-2>0,CODE($C2)-1>64),CHAR(CODE($C2)-1)&$D2-2,\"\")","v":""},{"$f":"IF(AND($D2-2>0,CODE($C2)+1<73),CHAR(CODE($C2)+1)&$D2-2,\"\")","v":""},{"$f":"IF(AND($D2+2<9,CODE($C2)-1>64),CHAR(CODE($C2)-1)&$D2+2,\"\")","v":""},{"$f":"IF(AND($D2+2<9,CODE($C2)+1<73),CHAR(CODE($C2)+1)&$D2+2,\"\")","v":"B3"},{"$f":"IF(AND($D2-1>0,CODE($C2)-2>64),CHAR(CODE($C2)-2)&$D2-1,\"\")","v":""},{"$f":"IF(AND($D2-1>0,CODE($C2)+2<73),CHAR(CODE($C2)+2)&$D2-1,\"\")","v":""},{"$f":"IF(AND($D2+1<9,CODE($C2)-2>64),CHAR(CODE($C2)-2)&$D2+1,\"\")","v":""},{"$f":"IF(AND($D2+1<9,CODE($C2)+2<73),CHAR(CODE($C2)+2)&$D2+1,\"\")","v":"C2"}]
[{"$f":"B3&C3&D3","v":"VSA2"},"VS","A",2,{"$f":"CONCATENATE(C3&D3,F3,G3,H3,I3,J3,K3,L3,M3)","v":"A2B4C1C3"},{"$f":"IF(AND($D3-2>0,CODE($C3)-1>64),CHAR(CODE($C3)-1)&$D3-2,\"\")","v":""},{"$f":"IF(AND($D3-2>0,CODE($C3)+1<73),CHAR(CODE($C3)+1)&$D3-2,\"\")","v":""},{"$f":"IF(AND($D3+2<9,CODE($C3)-1>64),CHAR(CODE($C3)-1)&$D3+2,\"\")","v":""},{"$f":"IF(AND($D3+2<9,CODE($C3)+1<73),CHAR(CODE($C3)+1)&$D3+2,\"\")","v":"B4"},{"$f":"IF(AND($D3-1>0,CODE($C3)-2>64),CHAR(CODE($C3)-2)&$D3-1,\"\")","v":""},{"$f":"IF(AND($D3-1>0,CODE($C3)+2<73),CHAR(CODE($C3)+2)&$D3-1,\"\")","v":"C1"},{"$f":"IF(AND($D3+1<9,CODE($C3)-2>64),CHAR(CODE($C3)-2)&$D3+1,\"\")","v":""},{"$f":"IF(AND($D3+1<9,CODE($C3)+2<73),CHAR(CODE($C3)+2)&$D3+1,\"\")","v":"C3"}]
["VSA3","VS","A",3,"A3B1B5C2C4","","B1","","B5","","C2","","C4"]
["VSA4","VS","A",4,"A4B2B6C3C5","","B2","","B6","","C3","","C5"]
["VSA5","VS","A",5,"A5B3B7C4C6","","B3","","B7","","C4","","C6"]
["VSA6","VS","A",6,"A6B4B8C5C7","","B4","","B8","","C5","","C7"]
["VSA7","VS","A",7,"A7B5C6C8","","B5","","","","C6","","C8"]
["VSA8","VS","A",8,"A8B6C7","","B6","","","","C7","",""]
["VSB1","VS","B",1,"B1A3C3D2","","","A3","C3","","","","D2"]
["VSB2","VS","B",2,"B2A4C4D1D3","","","A4","C4","","D1","","D3"]
["VSB3","VS","B",3,"B3A1C1A5C5D2D4","A1","C1","A5","C5","","D2","","D4"]
["VSB4","VS","B",4,"B4A2C2A6C6D3D5","A2","C2","A6","C6","","D3","","D5"]
["VSB5","VS","B",5,"B5A3C3A7C7D4D6","A3","C3","A7","C7","","D4","","D6"]
["VSB6","VS","B",6,"B6A4C4A8C8D5D7","A4","C4","A8","C8","","D5","","D7"]
["VSB7","VS","B",7,"B7A5C5D6D8","A5","C5","","","","D6","","D8"]
["VSB8","VS","B",8,"B8A6C6D7","A6","C6","","","","D7","",""]
["VSC1","VS","C",1,"C1B3D3A2E2","","","B3","D3","","","A2","E2"]
[{"$f":"B19&C19&D19","v":"VSC2"},"VS","C",2,"C2B4D4A1E1A3E3","","","B4","D4","A1","E1","A3","E3"]
[{"$f":"B20&C20&D20","v":"VSC3"},"VS","C",3,"C3B1D1B5D5A2E2A4E4","B1","D1","B5","D5","A2","E2","A4","E4"]
["VSC4","VS","C",4,"C4B2D2B6D6A3E3A5E5","B2","D2","B6","D6","A3","E3","A5","E5"]
["VSC5","VS","C",5,"C5B3D3B7D7A4E4A6E6","B3","D3","B7","D7","A4","E4","A6","E6"]
["VSC6","VS","C",6,"C6B4D4B8D8A5E5A7E7","B4","D4","B8","D8","A5","E5","A7","E7"]
["VSC7","VS","C",7,"C7B5D5A6E6A8E8","B5","D5","","","A6","E6","A8","E8"]
["VSC8","VS","C",8,"C8B6D6A7E7","B6","D6","","","A7","E7","",""]
["VSD1","VS","D",1,"D1C3E3B2F2","","","C3","E3","","","B2","F2"]
[{"$f":"B27&C27&D27","v":"VSD2"},"VS","D",2,"D2C4E4B1F1B3F3","","","C4","E4","B1","F1","B3","F3"]
[{"$f":"B28&C28&D28","v":"VSD3"},"VS","D",3,"D3C1E1C5E5B2F2B4F4","C1","E1","C5","E5","B2","F2","B4","F4"]
["VSD4","VS","D",4,"D4C2E2C6E6B3F3B5F5","C2","E2","C6","E6","B3","F3","B5","F5"]
["VSD5","VS","D",5,"D5C3E3C7E7B4F4B6F6","C3","E3","C7","E7","B4","F4","B6","F6"]
["VSD6","VS","D",6,"D6C4E4C8E8B5F5B7F7","C4","E4","C8","E8","B5","F5","B7","F7"]
["VSD7","VS","D",7,"D7C5E5B6F6B8F8","C5","E5","","","B6","F6","B8","F8"]
["VSD8","VS","D",8,"D8C6E6B7F7","C6","E6","","","B7","F7","",""]
["VSE1","VS","E",1,"E1D3F3C2G2","","","D3","F3","","","C2","G2"]
["VSE2","VS","E",2,"E2D4F4C1G1C3G3","","","D4","F4","C1","G1","C3","G3"]
["VSE3","VS","E",3,"E3D1F1D5F5C2G2C4G4","D1","F1","D5","F5","C2","G2","C4","G4"]
["VSE4","VS","E",4,"E4D2F2D6F6C3G3C5G5","D2","F2","D6","F6","C3","G3","C5","G5"]
["VSE5","VS","E",5,"E5D3F3D7F7C4G4C6G6","D3","F3","D7","F7","C4","G4","C6","G6"]
["VSE6","VS","E",6,"E6D4F4D8F8C5G5C7G7","D4","F4","D8","F8","C5","G5","C7","G7"]
["VSE7","VS","E",7,"E7D5F5C6G6C8G8","D5","F5","","","C6","G6","C8","G8"]
["VSE8","VS","E",8,"E8D6F6C7G7","D6","F6","","","C7","G7","",""]
["VSF1","VS","F",1,"F1E3G3D2H2","","","E3","G3","","","D2","H2"]
["VSF2","VS","F",2,"F2E4G4D1H1D3H3","","","E4","G4","D1","H1","D3","H3"]
["VSF3","VS","F",3,"F3E1G1E5G5D2H2D4H4","E1","G1","E5","G5","D2","H2","D4","H4"]
["VSF4","VS","F",4,"F4E2G2E6G6D3H3D5H5","E2","G2","E6","G6","D3","H3","D5","H5"]
["VSF5","VS","F",5,"F5E3G3E7G7D4H4D6H6","E3","G3","E7","G7","D4","H4","D6","H6"]
["VSF6","VS","F",6,"F6E4G4E8G8D5H5D7H7","E4","G4","E8","G8","D5","H5","D7","H7"]
["VSF7","VS","F",7,"F7E5G5D6H6D8H8","E5","G5","","","D6","H6","D8","H8"]
["VSF8","VS","F",8,"F8E6G6D7H7","E6","G6","","","D7","H7","",""]
["VSG1","VS","G",1,"G1F3H3E2","","","F3","H3","","","E2",""]
["VSG2","VS","G",2,"G2F4H4E1E3","","","F4","H4","E1","","E3",""]
["VSG3","VS","G",3,"G3F1H1F5H5E2E4","F1","H1","F5","H5","E2","","E4",""]
["VSG4","VS","G",4,"G4F2H2F6H6E3E5","F2","H2","F6","H6","E3","","E5",""]
["VSG5","VS","G",5,"G5F3H3F7H7E4E6","F3","H3","F7","H7","E4","","E6",""]
["VSG6","VS","G",6,"G6F4H4F8H8E5E7","F4","H4","F8","H8","E5","","E7",""]
["VSG7","VS","G",7,"G7F5H5E6E8","F5","H5","","","E6","","E8",""]
["VSG8","VS","G",8,"G8F6H6E7","F6","H6","","","E7","","",""]
["VSH1","VS","H",1,"H1G3F2","","","G3","","","","F2",""]
[{"$f":"B59&C59&D59","v":"VSH2"},"VS","H",2,"H2G4F1F3","","","G4","","F1","","F3",""]
[{"$f":"B60&C60&D60","v":"VSH3"},"VS","H",3,"H3G1G5F2F4","G1","","G5","","F2","","F4",""]
["VSH4","VS","H",4,"H4G2G6F3F5","G2","","G6","","F3","","F5",""]
["VSH5","VS","H",5,"H5G3G7F4F6","G3","","G7","","F4","","F6",""]
["VSH6","VS","H",6,"H6G4G8F5F7","G4","","G8","","F5","","F7",""]
["VSH7","VS","H",7,"H7G5F6F8","G5","","","","F6","","F8",""]
["VSH8","VS","H",8,"H8G6F7","G6","","","","F7","","",""]

{"sheet":"P_A1","index":13,"n_rows":33,"n_cols":20,"rows_kept":33,"cut":false,"hidden":true,"merged":[]}
[null,null,null,null,null,{"$f":"Logik!D1","v":"Pos:"},"Pjäs:","RäckviddX","Pos",{"$f":"RIGHT($E$2,LEN($E$2)-$E$4+1)","v":"A1B1C1D1E1F1G1H1"},{"$f":"LEFT($E$2,$E$4-1)","v":""},"RäckviddY",null,{"$f":"RIGHT($E$3,LEN($E$3)-$E$5+1)","v":"A1A2A3A4A5A6A7A8"},{"$f":"LEFT($E$3,$E$5-1)","v":""},"Nåbar","Vad","Poäng","PosPoäng","MöjligaDrag"]
["Pjäs:",{"$f":"Logik!E2","v":"A1"},null,"RäckviddX",{"$f":"IF($B$3<>\"\",\"A\"&B5&\"B\"&B5&\"C\"&B5&\"D\"&B5&\"E\"&B5&\"F\"&B5&\"G\"&B5&\"H\"&B5,\"\")","v":"A1B1C1D1E1F1G1H1"},{"$f":"UPPER(Logik!E1)","v":"A1"},{"$f":"UPPER(F2)","v":"A1"},{"$f":"IF($G2<>\"\",IF($G2<>$B$3,IF(IFERROR(FIND($G2,$E$2)>0,FALSE),TRUE,FALSE),FALSE),FALSE)","v":false},{"$f":"IF(H2,FIND($G2,$E$2),\"\")","v":""},{"$f":"IF(AND(I2<>\"\",I2>0,I2>$E$4),LEFT(J1,MIN(I2-$E$4+2,LEN(J1))),J1)","v":"A1B1C1D1E1F1G1H1"},{"$f":"IF(AND($G2<>\"\",$G2>0,$I2<$E$4),RIGHT(K1,MIN($E$4-$I2,LEN(K1))),K1)","v":""},{"$f":"IF($G2<>\"\",IF($G2<>$B$3,IF(IFERROR(FIND($G2,$E$3)>0,FALSE),TRUE,FALSE),FALSE),FALSE)","v":false},{"$f":"IF(L2,FIND($G2,$E$3),\"\")","v":""},{"$f":"IF(AND(M2<>\"\",M2>0,M2>$E$5),LEFT(N1,MIN(M2-$E$5+2,LEN(N1))),N1)","v":"A1A2A3A4A5A6A7A8"},{"$f":"IF(AND($G2<>\"\",$G2>0,M2<$E$5),RIGHT(O1,MIN($E$5-M2,LEN(O1))),O1)","v":""},{"$f":"IFERROR(IF(AND(G2<>\"\",$G2<>$B$3),FIND(G2,$E$8),\"\"),\"\")","v":""},"A1",{"$f":"IF(P2<>\"\",HLOOKUP(HLOOKUP(Q2,PjasStart,2,FALSE),Pjaser,4,FALSE),0)","v":0},{"$f":"IF(P2<>\"\",OFFSET(Logik!$D$4,0,ROW()-1),0)","v":0},{"$f":"SUBSTITUTE(E8,G2,\"\")","v":"B1A2"}]
["Pos:",{"$f":"UPPER(Logik!E1)","v":"A1"},null,"RäckviddY",{"$f":"IF($B$3<>\"\",B4&\"1\"&B4&\"2\"&B4&\"3\"&B4&\"4\"&B4&\"5\"&B4&\"6\"&B4&\"7\"&B4&\"8\",\"\")","v":"A1A2A3A4A5A6A7A8"},{"$f":"Logik!F1","v":"B1"},{"$f":"UPPER(F3)","v":"B1"},{"$f":"IF($G3<>\"\",IF($G3<>$B$3,IF(IFERROR(FIND($G3,$E$2)>0,FALSE),TRUE,FALSE),FALSE),FALSE)","v":true},{"$f":"IF(H3,FIND($G3,$E$2),\"\")","v":3},{"$f":"IF(AND(I3<>\"\",I3>0,I3>$E$4),LEFT(J2,MIN(I3-$E$4+2,LEN(J2))),J2)","v":"A1B1"},{"$f":"IF(AND($G3<>\"\",$G3>0,$I3<$E$4),RIGHT(K2,MIN($E$4-$I3,LEN(K2))),K2)","v":""},{"$f":"IF($G3<>\"\",IF($G3<>$B$3,IF(IFERROR(FIND($G3,$E$3)>0,FALSE),TRUE,FALSE),FALSE),FALSE)","v":false},{"$f":"IF(L3,FIND($G3,$E$3),\"\")","v":""},{"$f":"IF(AND(M3<>\"\",M3>0,M3>$E$5),LEFT(N2,MIN(M3-$E$5+2,LEN(N2))),N2)","v":"A1A2A3A4A5A6A7A8"},{"$f":"IF(AND($G3<>\"\",$G3>0,M3<$E$5),RIGHT(O2,MIN($E$5-M3,LEN(O2))),O2)","v":""},{"$f":"IFERROR(IF(AND(G3<>\"\",$G3<>$B$3),FIND(G3,$E$8),\"\"),\"\")","v":3},"B1",300,{"$f":"IF(P3<>\"\",OFFSET(Logik!$D$4,0,ROW()-1),0)","v":8},{"$f":"SUBSTITUTE(T2,G3,\"\")","v":"A2"}]
["PosX:",{"$f":"LEFT(B3,1)","v":"A"},null,"PosX",{"$f":"FIND(B3,E2)","v":1},{"$f":"Logik!G1","v":"C1"},"C1",true,5,"A1B1","",false,"","A1A2A3A4A5A6A7A8","","","C1",0,{"$f":"IF(P4<>\"\",OFFSET(Logik!$D$4,0,ROW()-1),0)","v":0},{"$f":"SUBSTITUTE(T3,G4,\"\")","v":"A2"}]
["PosY:",{"$f":"RIGHT(B3,1)","v":"1"},null,"PosY",{"$f":"FIND(B3,E3)","v":1},{"$f":"Logik!H1","v":"D1"},"D1",true,7,"A1B1","",false,"","A1A2A3A4A5A6A7A8","","","D1",0,{"$f":"IF(P5<>\"\",OFFSET(Logik!$D$4,0,ROW()-1),0)","v":0},"A2"]
[null,null,null,"RX",{"$f":"K33&J33","v":"A1B1"},{"$f":"Logik!I1","v":"E1"},"E1",true,9,"A1B1","",false,"","A1A2A3A4A5A6A7A8","","","E1",0,{"$f":"IF(P6<>\"\",OFFSET(Logik!$D$4,0,ROW()-1),0)","v":0},"A2"]
["Poäng",{"$f":"Logik!E3","v":500},null,"RY",{"$f":"O33&N33","v":"A1A2"},{"$f":"Logik!J1","v":"F1"},"F1",true,11,"A1B1","",false,"","A1A2A3A4A5A6A7A8","","","F1",0,{"$f":"IF(P7<>\"\",OFFSET(Logik!$D$4,0,ROW()-1),0)","v":0},"A2"]
["PosPoäng",{"$f":"Logik!E4","v":6},null,"RXY",{"$f":"E6&E7","v":"A1B1A1A2"},{"$f":"Logik!K1","v":"G1"},"G1",true,13,"A1B1","",false,"","A1A2A3A4A5A6A7A8","","","G1",0,{"$f":"IF(P8<>\"\",OFFSET(Logik!$D$4,0,ROW()-1),0)","v":0},"A2"]
[null,null,null,"Försvar",{"$f":"SUM(R2:R17)+SUM(S2:S17)","v":408},{"$f":"Logik!L1","v":"H1"},"H1",true,15,"A1B1","",false,"","A1A2A3A4A5A6A7A8","","","H1",0,{"$f":"IF(P9<>\"\",OFFSET(Logik!$D$4,0,ROW()-1),0)","v":0},"A2"]
[null,null,null,"Attack",{"$f":"SUM(R18:R33)+SUM(S18:S33)","v":0},{"$f":"Logik!M1","v":"A2"},"A2",false,"","A1B1","",true,3,"A1A2","",7,"A2",100,{"$f":"IF(P10<>\"\",OFFSET(Logik!$D$4,0,ROW()-1),0)","v":0},""]
[null,null,null,"R Antal",{"$f":"LEN(E8)/2","v":4},{"$f":"Logik!N1","v":"B2"},"B2",false,"","A1B1","",false,"","A1A2","","","B2",0,{"$f":"IF(P11<>\"\",OFFSET(Logik!$D$4,0,ROW()-1),0)","v":0},""]
[null,null,null,null,null,{"$f":"Logik!O1","v":"C2"},"C2",false,"","A1B1","",false,"","A1A2","","","C2",0,{"$f":"IF(P12<>\"\",OFFSET(Logik!$D$4,0,ROW()-1),0)","v":0},""]
[null,null,null,"MöjligaDrag",{"$f":"T17","v":""},{"$f":"Logik!P1","v":"D2"},"D2",false,"","A1B1","",false,"","A1A2","","","D2",0,{"$f":"IF(P13<>\"\",OFFSET(Logik!$D$4,0,ROW()-1),0)","v":0},""]
[null,null,null,"D Antal",{"$f":"LEN(E13)/2","v":0},{"$f":"Logik!Q1","v":"E2"},"E2",false,"","A1B1","",false,"","A1A2","","","E2",0,{"$f":"IF(P14<>\"\",OFFSET(Logik!$D$4,0,ROW()-1),0)","v":0},""]
[null,null,null,null,null,{"$f":"Logik!R1","v":"F2"},"F2",false,"","A1B1","",false,"","A1A2","","","F2",0,{"$f":"IF(P15<>\"\",OFFSET(Logik!$D$4,0,ROW()-1),0)","v":0},""]
[null,null,null,null,null,{"$f":"Logik!S1","v":"G2"},"G2",false,"","A1B1","",false,"","A1A2","","","G2",0,{"$f":"IF(P16<>\"\",OFFSET(Logik!$D$4,0,ROW()-1),0)","v":0},""]
[null,null,null,null,null,{"$f":"Logik!T1","v":"H2"},"H2",false,"","A1B1","",false,"","A1A2","","","H2",0,{"$f":"IF(P17<>\"\",OFFSET(Logik!$D$4,0,ROW()-1),0)","v":0},""]
[null,null,null,null,null,{"$f":"Logik!U1","v":"A7"},"A7",false,"","A1B1","",true,13,"A1A2","","","A7",{"$f":"IF(P18<>\"\",HLOOKUP(HLOOKUP(Q18,PjasStart,2,FALSE),Pjaser,3,FALSE),0)","v":0},{"$f":"IF(P18<>\"\",OFFSET(Logik!$D$4,0,ROW()-1),0)","v":0}]
[null,null,null,null,null,{"$f":"Logik!V1","v":"B7"},"B7",false,"","A1B1","",false,"","A1A2","","","B7",0,{"$f":"IF(P19<>\"\",OFFSET(Logik!$D$4,0,ROW()-1),0)","v":0}]
[null,null,null,null,null,{"$f":"Logik!W1","v":"C7"},"C7",false,"","A1B1","",false,"","A1A2","","","C7",0,{"$f":"IF(P20<>\"\",OFFSET(Logik!$D$4,0,ROW()-1),0)","v":0}]
[null,null,null,null,null,{"$f":"Logik!X1","v":"D7"},"D7",false,"","A1B1","",false,"","A1A2","","","D7",0,{"$f":"IF(P21<>\"\",OFFSET(Logik!$D$4,0,ROW()-1),0)","v":0}]
[null,null,null,null,null,{"$f":"Logik!Y1","v":"E7"},"E7",false,"","A1B1","",false,"","A1A2","","","E7",0,{"$f":"IF(P22<>\"\",OFFSET(Logik!$D$4,0,ROW()-1),0)","v":0}]
[null,null,null,null,null,{"$f":"Logik!Z1","v":"F7"},"F7",false,"","A1B1","",false,"","A1A2","","","F7",0,{"$f":"IF(P23<>\"\",OFFSET(Logik!$D$4,0,ROW()-1),0)","v":0}]
[null,null,null,null,null,{"$f":"Logik!AA1","v":"G7"},"G7",false,"","A1B1","",false,"","A1A2","","","G7",0,{"$f":"IF(P24<>\"\",OFFSET(Logik!$D$4,0,ROW()-1),0)","v":0}]
[null,null,null,null,null,{"$f":"Logik!AB1","v":"H7"},"H7",false,"","A1B1","",false,"","A1A2","","","H7",0,{"$f":"IF(P25<>\"\",OFFSET(Logik!$D$4,0,ROW()-1),0)","v":0}]
[null,null,null,null,null,{"$f":"Logik!AC1","v":"A8"},"A8",false,"","A1B1","",true,15,"A1A2","","","A8",0,{"$f":"IF(P26<>\"\",OFFSET(Logik!$D$4,0,ROW()-1),0)","v":0}]
[null,null,null,null,null,{"$f":"Logik!AD1","v":"B8"},"B8",false,"","A1B1","",false,"","A1A2","","","B8",0,{"$f":"IF(P27<>\"\",OFFSET(Logik!$D$4,0,ROW()-1),0)","v":0}]
[null,null,null,null,null,{"$f":"Logik!AE1","v":"C8"},"C8",false,"","A1B1","",false,"","A1A2","","","C8",0,{"$f":"IF(P28<>\"\",OFFSET(Logik!$D$4,0,ROW()-1),0)","v":0}]
[null,null,null,null,null,{"$f":"Logik!AF1","v":"D8"},"D8",false,"","A1B1","",false,"","A1A2","","","D8",0,{"$f":"IF(P29<>\"\",OFFSET(Logik!$D$4,0,ROW()-1),0)","v":0}]
[null,null,null,null,null,{"$f":"Logik!AG1","v":"E8"},"E8",false,"","A1B1","",false,"","A1A2","","","E8",0,{"$f":"IF(P30<>\"\",OFFSET(Logik!$D$4,0,ROW()-1),0)","v":0}]
[null,null,null,null,null,{"$f":"Logik!AH1","v":"F8"},"F8",false,"","A1B1","",false,"","A1A2","","","F8",0,{"$f":"IF(P31<>\"\",OFFSET(Logik!$D$4,0,ROW()-1),0)","v":0}]
[null,null,null,null,null,{"$f":"Logik!AI1","v":"G8"},"G8",false,"","A1B1","",false,"","A1A2","","","G8",0,{"$f":"IF(P32<>\"\",OFFSET(Logik!$D$4,0,ROW()-1),0)","v":0}]
[null,null,null,null,null,{"$f":"Logik!AJ1","v":"H8"},"H8",false,"","A1B1","",false,"","A1A2","","","H8",0,{"$f":"IF(P33<>\"\",OFFSET(Logik!$D$4,0,ROW()-1),0)","v":0}]

{"sheet":"P_B1","index":14,"n_rows":33,"n_cols":20,"rows_kept":33,"cut":false,"hidden":true,"merged":[]}
[null,null,null,null,null,{"$f":"Logik!D1","v":"Pos:"},"Pjäs:","RäckviddX","Pos",{"$f":"SUBSTITUTE(E2,B3,\"\")","v":"A3C3D2"},{"$f":"LEFT($E$2,$E$4-1)","v":""},null,null,null,null,"Nåbar","Vad","Poäng","PosPoäng","MöjligaDrag"]
["Pjäs:",{"$f":"Logik!F2","v":"B1"},null,"RäckviddX",{"$f":"IFERROR(INDEX(tblRVS,MATCH(\"VS\"&$B$3,RVS!$A$2:$A$120,0),5),\"\")","v":"B1A3C3D2"},{"$f":"UPPER(Logik!E1)","v":"A1"},{"$f":"UPPER(F2)","v":"A1"},{"$f":"IF($G2<>\"\",IF($G2<>$B$3,IF(IFERROR(FIND($G2,$E$2)>0,FALSE),TRUE,FALSE),FALSE),FALSE)","v":false},{"$f":"IF(H2,FIND($G2,$E$2),\"\")","v":""},{"$f":"J1","v":"A3C3D2"},{"$f":"IF(AND($G2<>\"\",$G2>0,$I2<$E$4),RIGHT(K1,MIN($E$4-$I2,LEN(K1))),K1)","v":""},null,null,null,null,{"$f":"IFERROR(IF(AND(G2<>\"\",$G2<>$B$3),FIND(G2,$E$6),\"\"),\"\")","v":""},"A1",{"$f":"IF(P2<>\"\",HLOOKUP(HLOOKUP(Q2,PjasStart,2,FALSE),Pjaser,4,FALSE),0)","v":0},{"$f":"IF(P2<>\"\",OFFSET(Logik!$D$4,0,ROW()-1),0)","v":0},{"$f":"SUBSTITUTE(E6,G2,\"\")","v":"A3C3D2"}]
["Pos:",{"$f":"UPPER(Logik!F1)","v":"B1"},null,null,null,{"$f":"Logik!F1","v":"B1"},{"$f":"UPPER(F3)","v":"B1"},{"$f":"IF($G3<>\"\",IF($G3<>$B$3,IF(IFERROR(FIND($G3,$E$2)>0,FALSE),TRUE,FALSE),FALSE),FALSE)","v":false},{"$f":"IF(H3,FIND($G3,$E$2),\"\")","v":""},{"$f":"J2","v":"A3C3D2"},{"$f":"IF(AND($G3<>\"\",$G3>0,$I3<$E$4),RIGHT(K2,MIN($E$4-$I3,LEN(K2))),K2)","v":""},null,null,null,null,{"$f":"IFERROR(IF(AND(G3<>\"\",$G3<>$B$3),FIND(G3,$E$6),\"\"),\"\")","v":""},"B1",0,{"$f":"IF(P3<>\"\",OFFSET(Logik!$D$4,0,ROW()-1),0)","v":0},{"$f":"SUBSTITUTE(T2,G3,\"\")","v":"A3C3D2"}]
["PosX:",{"$f":"LEFT(B3,1)","v":"B"},null,"PosX",{"$f":"FIND(B3,E2)","v":1},{"$f":"Logik!G1","v":"C1"},"C1",false,"","A3C3D2","",null,null,null,null,"","C1",0,{"$f":"IF(P4<>\"\",OFFSET(Logik!$D$4,0,ROW()-1),0)","v":0},{"$f":"SUBSTITUTE(T3,G4,\"\")","v":"A3C3D2"}]
["PosY:",{"$f":"RIGHT(B3,1)","v":"1"},null,null,null,{"$f":"Logik!H1","v":"D1"},"D1",false,"","A3C3D2","",null,null,null,null,"","D1",0,{"$f":"IF(P5<>\"\",OFFSET(Logik!$D$4,0,ROW()-1),0)","v":0},"A3C3D2"]
[null,null,null,"RX",{"$f":"K33&J33","v":"A3C3D2"},{"$f":"Logik!I1","v":"E1"},"E1",false,"","A3C3D2","",null,null,null,null,"","E1",0,{"$f":"IF(P6<>\"\",OFFSET(Logik!$D$4,0,ROW()-1),0)","v":0},"A3C3D2"]
["Poäng",{"$f":"Logik!F3","v":300},null,null,null,{"$f":"Logik!J1","v":"F1"},"F1",false,"","A3C3D2","",null,null,null,null,"","F1",0,{"$f":"IF(P7<>\"\",OFFSET(Logik!$D$4,0,ROW()-1),0)","v":0},"A3C3D2"]
["PosPoäng",{"$f":"Logik!F4","v":8},null,null,null,{"$f":"Logik!K1","v":"G1"},"G1",false,"","A3C3D2","",null,null,null,null,"","G1",0,{"$f":"IF(P8<>\"\",OFFSET(Logik!$D$4,0,ROW()-1),0)","v":0},"A3C3D2"]
[null,null,null,"Försvar",{"$f":"SUM(R2:R17)+SUM(S2:S17)","v":100},{"$f":"Logik!L1","v":"H1"},"H1",false,"","A3C3D2","",null,null,null,null,"","H1",0,{"$f":"IF(P9<>\"\",OFFSET(Logik!$D$4,0,ROW()-1),0)","v":0},"A3C3D2"]
[null,null,null,"Attack",{"$f":"SUM(R18:R33)+SUM(S18:S33)","v":0},{"$f":"Logik!M1","v":"A2"},"A2",false,"","A3C3D2","",null,null,null,null,"","A2",0,{"$f":"IF(P10<>\"\",OFFSET(Logik!$D$4,0,ROW()-1),0)","v":0},"A3C3D2"]
[null,null,null,"R Antal",{"$f":"LEN(E6)/2","v":3},{"$f":"Logik!N1","v":"B2"},"B2",false,"","A3C3D2","",null,null,null,null,"","B2",0,{"$f":"IF(P11<>\"\",OFFSET(Logik!$D$4,0,ROW()-1),0)","v":0},"A3C3D2"]
[null,null,null,null,null,{"$f":"Logik!O1","v":"C2"},"C2",false,"","A3C3D2","",null,null,null,null,"","C2",0,{"$f":"IF(P12<>\"\",OFFSET(Logik!$D$4,0,ROW()-1),0)","v":0},"A3C3D2"]
[null,null,null,"MöjligaDrag",{"$f":"T17","v":"A3C3"},{"$f":"Logik!P1","v":"D2"},"D2",true,7,"A3C3D2","",null,null,null,null,5,"D2",100,{"$f":"IF(P13<>\"\",OFFSET(Logik!$D$4,0,ROW()-1),0)","v":0},"A3C3"]
[null,null,null,"D Antal",{"$f":"LEN(E13)/2","v":2},{"$f":"Logik!Q1","v":"E2"},"E2",false,"","A3C3D2","",null,null,null,null,"","E2",0,{"$f":"IF(P14<>\"\",OFFSET(Logik!$D$4,0,ROW()-1),0)","v":0},"A3C3"]
[null,null,null,null,null,{"$f":"Logik!R1","v":"F2"},"F2",false,"","A3C3D2","",null,null,null,null,"","F2",0,{"$f":"IF(P15<>\"\",OFFSET(Logik!$D$4,0,ROW()-1),0)","v":0},"A3C3"]
[null,null,null,null,null,{"$f":"Logik!S1","v":"G2"},"G2",false,"","A3C3D2","",null,null,null,null,"","G2",0,{"$f":"IF(P16<>\"\",OFFSET(Logik!$D$4,0,ROW()-1),0)","v":0},"A3C3"]
[null,null,null,null,null,{"$f":"Logik!T1","v":"H2"},"H2",false,"","A3C3D2","",null,null,null,null,"","H2",0,{"$f":"IF(P17<>\"\",OFFSET(Logik!$D$4,0,ROW()-1),0)","v":0},"A3C3"]
[null,null,null,null,null,{"$f":"Logik!U1","v":"A7"},"A7",false,"","A3C3D2","",null,null,null,null,"","A7",{"$f":"IF(P18<>\"\",HLOOKUP(HLOOKUP(Q18,PjasStart,2,FALSE),Pjaser,3,FALSE),0)","v":0},{"$f":"IF(P18<>\"\",OFFSET(Logik!$D$4,0,ROW()-1),0)","v":0}]
[null,null,null,null,null,{"$f":"Logik!V1","v":"B7"},"B7",false,"","A3C3D2","",null,null,null,null,"","B7",0,{"$f":"IF(P19<>\"\",OFFSET(Logik!$D$4,0,ROW()-1),0)","v":0}]
[null,null,null,null,null,{"$f":"Logik!W1","v":"C7"},"C7",false,"","A3C3D2","",null,null,null,null,"","C7",0,{"$f":"IF(P20<>\"\",OFFSET(Logik!$D$4,0,ROW()-1),0)","v":0}]
[null,null,null,null,null,{"$f":"Logik!X1","v":"D7"},"D7",false,"","A3C3D2","",null,null,null,null,"","D7",0,{"$f":"IF(P21<>\"\",OFFSET(Logik!$D$4,0,ROW()-1),0)","v":0}]
[null,null,null,null,null,{"$f":"Logik!Y1","v":"E7"},"E7",false,"","A3C3D2","",null,null,null,null,"","E7",0,{"$f":"IF(P22<>\"\",OFFSET(Logik!$D$4,0,ROW()-1),0)","v":0}]
[null,null,null,null,null,{"$f":"Logik!Z1","v":"F7"},"F7",false,"","A3C3D2","",null,null,null,null,"","F7",0,{"$f":"IF(P23<>\"\",OFFSET(Logik!$D$4,0,ROW()-1),0)","v":0}]
[null,null,null,null,null,{"$f":"Logik!AA1","v":"G7"},"G7",false,"","A3C3D2","",null,null,null,null,"","G7",0,{"$f":"IF(P24<>\"\",OFFSET(Logik!$D$4,0,ROW()-1),0)","v":0}]
[null,null,null,null,null,{"$f":"Logik!AB1","v":"H7"},"H7",false,"","A3C3D2","",null,null,null,null,"","H7",0,{"$f":"IF(P25<>\"\",OFFSET(Logik!$D$4,0,ROW()-1),0)","v":0}]
[null,null,null,null,null,{"$f":"Logik!AC1","v":"A8"},"A8",false,"","A3C3D2","",null,null,null,null,"","A8",0,{"$f":"IF(P26<>\"\",OFFSET(Logik!$D$4,0,ROW()-1),0)","v":0}]
[null,null,null,null,null,{"$f":"Logik!AD1","v":"B8"},"B8",false,"","A3C3D2","",null,null,null,null,"","B8",0,{"$f":"IF(P27<>\"\",OFFSET(Logik!$D$4,0,ROW()-1),0)","v":0}]
[null,null,null,null,null,{"$f":"Logik!AE1","v":"C8"},"C8",false,"","A3C3D2","",null,null,null,null,"","C8",0,{"$f":"IF(P28<>\"\",OFFSET(Logik!$D$4,0,ROW()-1),0)","v":0}]
[null,null,null,null,null,{"$f":"Logik!AF1","v":"D8"},"D8",false,"","A3C3D2","",null,null,null,null,"","D8",0,{"$f":"IF(P29<>\"\",OFFSET(Logik!$D$4,0,ROW()-1),0)","v":0}]
[null,null,null,null,null,{"$f":"Logik!AG1","v":"E8"},"E8",false,"","A3C3D2","",null,null,null,null,"","E8",0,{"$f":"IF(P30<>\"\",OFFSET(Logik!$D$4,0,ROW()-1),0)","v":0}]
[null,null,null,null,null,{"$f":"Logik!AH1","v":"F8"},"F8",false,"","A3C3D2","",null,null,null,null,"","F8",0,{"$f":"IF(P31<>\"\",OFFSET(Logik!$D$4,0,ROW()-1),0)","v":0}]
[null,null,null,null,null,{"$f":"Logik!AI1","v":"G8"},"G8",false,"","A3C3D2","",null,null,null,null,"","G8",0,{"$f":"IF(P32<>\"\",OFFSET(Logik!$D$4,0,ROW()-1),0)","v":0}]
[null,null,null,null,null,{"$f":"Logik!AJ1","v":"H8"},"H8",false,"","A3C3D2","",null,null,null,null,"","H8",0,{"$f":"IF(P33<>\"\",OFFSET(Logik!$D$4,0,ROW()-1),0)","v":0}]

{"sheet":"P_C1","index":15,"n_rows":33,"n_cols":20,"rows_kept":33,"cut":false,"hidden":true,"merged":[]}
[null,null,null,null,null,{"$f":"Logik!D1","v":"Pos:"},"Pjäs:","Fräckvidd","Pos",{"$f":"RIGHT($E$23,LEN($E$23)-$E$4+1)","v":"C1"},{"$f":"LEFT($E$23,$E$4-1)","v":"H6G5F4E3D2"},"Fräckvidd","Pos",{"$f":"RIGHT($E$24,LEN($E$24)-$E$5+1)","v":"C1B2A3"},{"$f":"LEFT($E$24,$E$5-1)","v":""},"Nåbar","Vad","Poäng","PosPoäng","MöjligaDrag"]
["Pjäs:",{"$f":"Logik!G2","v":"C1"},null,null,null,{"$f":"UPPER(Logik!E1)","v":"A1"},{"$f":"UPPER(F2)","v":"A1"},{"$f":"IF($G2<>\"\",IF($G2<>$B$3,IF(IFERROR(FIND($G2,$E$23)>0,FALSE),TRUE,FALSE),FALSE),FALSE)","v":false},{"$f":"IF(H2,FIND($G2,$E$23),\"\")","v":""},{"$f":"IFERROR(IF(AND($I2<>\"\",$I2>0,$I2>$E$4),LEFT(J1,MIN($I2-$E$4+2,LEN(J1))),J1),J1)","v":"C1"},{"$f":"IF(AND($I2<>\"\",$I2>0,$I2<$E$4),RIGHT(K1,MIN($E$4-$I2,LEN(K1))),K1)","v":"H6G5F4E3D2"},{"$f":"IF($G2<>\"\",IF($G2<>$B$3,IF(IFERROR(FIND($G2,$E$24)>0,FALSE),TRUE,FALSE),FALSE),FALSE)","v":false},{"$f":"IF(L2,FIND($G2,$E$24),\"\")","v":""},{"$f":"IFERROR(IF(AND($M2<>\"\",$M2>0,$M2>$E$5),LEFT(N1,MIN($M2-$E$5+2,LEN(N1))),N1),N1)","v":"C1B2A3"},{"$f":"IF(AND($M2<>\"\",$M2>0,$M2<$E$5),RIGHT(O1,MIN($E$5-$M2,LEN(O1))),O1)","v":""},{"$f":"IFERROR(IF(AND(G2<>\"\",$G2<>$B$3),FIND(G2,$E$8),\"\"),\"\")","v":""},"A1",{"$f":"IF(P2<>\"\",HLOOKUP(HLOOKUP(Q2,PjasStart,2,FALSE),Pjaser,4,FALSE),0)","v":0},{"$f":"IF(P2<>\"\",OFFSET(Logik!$D$4,0,ROW()-1),0)","v":0},{"$f":"SUBSTITUTE(E8,G2,\"\")","v":"D2C1C1B2"}]
["Pos:",{"$f":"UPPER(Logik!G1)","v":"C1"},null,null,null,{"$f":"Logik!F1","v":"B1"},{"$f":"UPPER(F3)","v":"B1"},{"$f":"IF($G3<>\"\",IF($G3<>$B$3,IF(IFERROR(FIND($G3,$E$23)>0,FALSE),TRUE,FALSE),FALSE),FALSE)","v":false},{"$f":"IF(H3,FIND($G3,$E$23),\"\")","v":""},{"$f":"IFERROR(IF(AND($I3<>\"\",$I3>0,$I3>$E$4),LEFT(J2,MIN($I3-$E$4+2,LEN(J2))),J2),J2)","v":"C1"},{"$f":"IF(AND($I3<>\"\",$I3>0,$I3<$E$4),RIGHT(K2,MIN($E$4-$I3,LEN(K2))),K2)","v":"H6G5F4E3D2"},{"$f":"IF($G3<>\"\",IF($G3<>$B$3,IF(IFERROR(FIND($G3,$E$24)>0,FALSE),TRUE,FALSE),FALSE),FALSE)","v":false},{"$f":"IF(L3,FIND($G3,$E$24),\"\")","v":""},{"$f":"IFERROR(IF(AND($M3<>\"\",$M3>0,$M3>$E$5),LEFT(N2,MIN($M3-$E$5+2,LEN(N2))),N2),N2)","v":"C1B2A3"},{"$f":"IF(AND($M3<>\"\",$M3>0,$M3<$E$5),RIGHT(O2,MIN($E$5-$M3,LEN(O2))),O2)","v":""},{"$f":"IFERROR(IF(AND(G3<>\"\",$G3<>$B$3),FIND(G3,$E$8),\"\"),\"\")","v":""},"B1",0,{"$f":"IF(P3<>\"\",OFFSET(Logik!$D$4,0,ROW()-1),0)","v":0},{"$f":"SUBSTITUTE(T2,G3,\"\")","v":"D2C1C1B2"}]
["PosX:",{"$f":"LEFT(B3,1)","v":"C"},null,"PosX",{"$f":"FIND(B3,E23)","v":11},{"$f":"Logik!G1","v":"C1"},"C1",false,"","C1","H6G5F4E3D2",false,"","C1B2A3","","","C1",0,{"$f":"IF(P4<>\"\",OFFSET(Logik!$D$4,0,ROW()-1),0)","v":0},{"$f":"SUBSTITUTE(T3,G4,\"\")","v":"D2B2"}]
["PosY:",{"$f":"RIGHT(B3,1)","v":"1"},null,"PosY",{"$f":"IFERROR(FIND(B3,E24),0)","v":1},{"$f":"Logik!H1","v":"D1"},"D1",false,"","C1","H6G5F4E3D2",false,"","C1B2A3","","","D1",0,{"$f":"IF(P5<>\"\",OFFSET(Logik!$D$4,0,ROW()-1),0)","v":0},"D2B2"]
[null,null,null,"RA",{"$f":"K33&J33","v":"D2C1"},{"$f":"Logik!I1","v":"E1"},"E1",false,"","C1","H6G5F4E3D2",false,"","C1B2A3","","","E1",0,{"$f":"IF(P6<>\"\",OFFSET(Logik!$D$4,0,ROW()-1),0)","v":0},"D2B2"]
["Poäng",{"$f":"Logik!G3","v":300},null,"RB",{"$f":"O33&N33","v":"C1B2"},{"$f":"Logik!J1","v":"F1"},"F1",false,"","C1","H6G5F4E3D2",false,"","C1B2A3","","","F1",0,{"$f":"IF(P7<>\"\",OFFSET(Logik!$D$4,0,ROW()-1),0)","v":0},"D2B2"]
["PosPoäng",{"$f":"Logik!G4","v":10},null,"RAB",{"$f":"E6&E7","v":"D2C1C1B2"},{"$f":"Logik!K1","v":"G1"},"G1",false,"","C1","H6G5F4E3D2",false,"","C1B2A3","","","G1",0,{"$f":"IF(P8<>\"\",OFFSET(Logik!$D$4,0,ROW()-1),0)","v":0},"D2B2"]
[null,null,null,"Försvar",{"$f":"SUM(R2:R17)+SUM(S2:S17)","v":200},{"$f":"Logik!L1","v":"H1"},"H1",false,"","C1","H6G5F4E3D2",false,"","C1B2A3","","","H1",0,{"$f":"IF(P9<>\"\",OFFSET(Logik!$D$4,0,ROW()-1),0)","v":0},"D2B2"]
[null,null,null,"Attack",{"$f":"SUM(R18:R33)+SUM(S18:S33)","v":0},{"$f":"Logik!M1","v":"A2"},"A2",false,"","C1","H6G5F4E3D2",false,"","C1B2A3","","","A2",0,{"$f":"IF(P10<>\"\",OFFSET(Logik!$D$4,0,ROW()-1),0)","v":0},"D2B2"]
[null,null,null,"R Antal",{"$f":"LEN(E8)/2","v":4},{"$f":"Logik!N1","v":"B2"},"B2",false,"","C1","H6G5F4E3D2",true,3,"C1B2","",7,"B2",100,{"$f":"IF(P11<>\"\",OFFSET(Logik!$D$4,0,ROW()-1),0)","v":0},"D2"]
[null,null,null,null,null,{"$f":"Logik!O1","v":"C2"},"C2",false,"","C1","H6G5F4E3D2",false,"","C1B2","","","C2",0,{"$f":"IF(P12<>\"\",OFFSET(Logik!$D$4,0,ROW()-1),0)","v":0},"D2"]
[null,null,null,"FRvA",{"$f":"IFERROR(INDEX(tblRVL,MATCH(\"VL\"&$B$3,RVL!$A$2:$A$129,0),5),\"\")","v":"C1"},{"$f":"Logik!P1","v":"D2"},"D2",true,9,"C1","D2",false,"","C1B2","",1,"D2",100,{"$f":"IF(P13<>\"\",OFFSET(Logik!$D$4,0,ROW()-1),0)","v":0},""]
[null,null,null,"FRvB",{"$f":"IFERROR(INDEX(tblRVL,MATCH(\"VL\"&$B$3,RVL!$A$2:$A$129,0),6),\"\")","v":"C1B2A3"},{"$f":"Logik!Q1","v":"E2"},"E2",false,"","C1","D2",false,"","C1B2","","","E2",0,{"$f":"IF(P14<>\"\",OFFSET(Logik!$D$4,0,ROW()-1),0)","v":0},""]
[null,null,null,"FRvC",{"$f":"IFERROR(INDEX(tblRVL,MATCH(\"VL\"&$B$3,RVL!$A$2:$A$129,0),7),\"\")","v":""},{"$f":"Logik!R1","v":"F2"},"F2",false,"","C1","D2",false,"","C1B2","","","F2",0,{"$f":"IF(P15<>\"\",OFFSET(Logik!$D$4,0,ROW()-1),0)","v":0},""]
[null,null,null,"FRvD",{"$f":"IFERROR(INDEX(tblRVL,MATCH(\"VL\"&$B$3,RVL!$A$2:$A$129,0),8),\"\")","v":"H6G5F4E3D2"},{"$f":"Logik!S1","v":"G2"},"G2",false,"","C1","D2",false,"","C1B2","","","G2",0,{"$f":"IF(P16<>\"\",OFFSET(Logik!$D$4,0,ROW()-1),0)","v":0},""]
[null,null,null,null,null,{"$f":"Logik!T1","v":"H2"},"H2",false,"","C1","D2",false,"","C1B2","","","H2",0,{"$f":"IF(P17<>\"\",OFFSET(Logik!$D$4,0,ROW()-1),0)","v":0},""]
[null,null,null,"ARvA",{"$f":"IFERROR(INDEX(tblRVL,MATCH(\"VL\"&$B$3,RVL!$A$2:$A$129,0),9),\"\")","v":""},{"$f":"Logik!U1","v":"A7"},"A7",false,"","C1","D2",false,"","C1B2","","","A7",{"$f":"IF(P18<>\"\",HLOOKUP(HLOOKUP(Q18,PjasStart,2,FALSE),Pjaser,3,FALSE),0)","v":0},{"$f":"IF(P18<>\"\",OFFSET(Logik!$D$4,0,ROW()-1),0)","v":0}]
[null,null,null,"ARvB",{"$f":"IFERROR(INDEX(tblRVL,MATCH(\"VL\"&$B$3,RVL!$A$2:$A$129,0),10),\"\")","v":"B2A3"},{"$f":"Logik!V1","v":"B7"},"B7",false,"","C1","D2",false,"","C1B2","","","B7",0,{"$f":"IF(P19<>\"\",OFFSET(Logik!$D$4,0,ROW()-1),0)","v":0}]
[null,null,null,"ARvC",{"$f":"IFERROR(INDEX(tblRVL,MATCH(\"VL\"&$B$3,RVL!$A$2:$A$129,0),11),\"\")","v":""},{"$f":"Logik!W1","v":"C7"},"C7",false,"","C1","D2",false,"","C1B2","","","C7",0,{"$f":"IF(P20<>\"\",OFFSET(Logik!$D$4,0,ROW()-1),0)","v":0}]
[null,null,null,"ARvD",{"$f":"IFERROR(INDEX(tblRVL,MATCH(\"VL\"&$B$3,RVL!$A$2:$A$129,0),12),\"\")","v":"H6G5F4E3D2"},{"$f":"Logik!X1","v":"D7"},"D7",false,"","C1","D2",false,"","C1B2","","","D7",0,{"$f":"IF(P21<>\"\",OFFSET(Logik!$D$4,0,ROW()-1),0)","v":0}]
[null,null,null,null,null,{"$f":"Logik!Y1","v":"E7"},"E7",false,"","C1","D2",false,"","C1B2","","","E7",0,{"$f":"IF(P22<>\"\",OFFSET(Logik!$D$4,0,ROW()-1),0)","v":0}]
[null,null,null,"FR1",{"$f":"E16&E13","v":"H6G5F4E3D2C1"},{"$f":"Logik!Z1","v":"F7"},"F7",false,"","C1","D2",false,"","C1B2","","","F7",0,{"$f":"IF(P23<>\"\",OFFSET(Logik!$D$4,0,ROW()-1),0)","v":0}]
[null,null,null,"FR2",{"$f":"E15&E14","v":"C1B2A3"},{"$f":"Logik!AA1","v":"G7"},"G7",false,"","C1","D2",false,"","C1B2","","","G7",0,{"$f":"IF(P24<>\"\",OFFSET(Logik!$D$4,0,ROW()-1),0)","v":0}]
[null,null,null,null,null,{"$f":"Logik!AB1","v":"H7"},"H7",false,"","C1","D2",false,"","C1B2","","","H7",0,{"$f":"IF(P25<>\"\",OFFSET(Logik!$D$4,0,ROW()-1),0)","v":0}]
[null,null,null,"MöjligaDrag",{"$f":"T17","v":""},{"$f":"Logik!AC1","v":"A8"},"A8",false,"","C1","D2",false,"","C1B2","","","A8",0,{"$f":"IF(P26<>\"\",OFFSET(Logik!$D$4,0,ROW()-1),0)","v":0}]
[null,null,null,"D Antal",{"$f":"LEN(E26)/2","v":0},{"$f":"Logik!AD1","v":"B8"},"B8",false,"","C1","D2",false,"","C1B2","","","B8",0,{"$f":"IF(P27<>\"\",OFFSET(Logik!$D$4,0,ROW()-1),0)","v":0}]
[null,null,null,null,null,{"$f":"Logik!AE1","v":"C8"},"C8",false,"","C1","D2",false,"","C1B2","","","C8",0,{"$f":"IF(P28<>\"\",OFFSET(Logik!$D$4,0,ROW()-1),0)","v":0}]
[null,null,null,null,null,{"$f":"Logik!AF1","v":"D8"},"D8",false,"","C1","D2",false,"","C1B2","","","D8",0,{"$f":"IF(P29<>\"\",OFFSET(Logik!$D$4,0,ROW()-1),0)","v":0}]
[null,null,null,null,null,{"$f":"Logik!AG1","v":"E8"},"E8",false,"","C1","D2",false,"","C1B2","","","E8",0,{"$f":"IF(P30<>\"\",OFFSET(Logik!$D$4,0,ROW()-1),0)","v":0}]
[null,null,null,null,null,{"$f":"Logik!AH1","v":"F8"},"F8",false,"","C1","D2",false,"","C1B2","","","F8",0,{"$f":"IF(P31<>\"\",OFFSET(Logik!$D$4,0,ROW()-1),0)","v":0}]
[null,null,null,null,null,{"$f":"Logik!AI1","v":"G8"},"G8",false,"","C1","D2",false,"","C1B2","","","G8",0,{"$f":"IF(P32<>\"\",OFFSET(Logik!$D$4,0,ROW()-1),0)","v":0}]
[null,null,null,null,null,{"$f":"Logik!AJ1","v":"H8"},"H8",false,"","C1","D2",false,"","C1B2","","","H8",0,{"$f":"IF(P33<>\"\",OFFSET(Logik!$D$4,0,ROW()-1),0)","v":0}]

{"sheet":"P_D1","index":16,"n_rows":33,"n_cols":28,"rows_kept":33,"cut":false,"hidden":true,"merged":[]}
[null,null,null,null,null,{"$f":"Logik!D1","v":"Pos:"},"Pjäs:","Diagonal1","Pos",{"$f":"RIGHT($E$21,LEN($E$21)-$E$2+1)","v":"D1"},{"$f":"LEFT($E$21,$E$2-1)","v":"H5G4F3E2"},"Diagonal2","Pos",{"$f":"RIGHT($E$22,LEN($E$22)-$E$3+1)","v":"D1C2B3A4"},{"$f":"LEFT($E$22,$E$3-1)","v":""},"Rät1","Pos",{"$f":"RIGHT($E$23,LEN($E$23)-$E$4+1)","v":"D1E1F1G1H1"},{"$f":"LEFT($E$23,$E$4-1)","v":"A1B1C1"},"Rät2","Pos",{"$f":"RIGHT($E$24,LEN($E$24)-$E$5+1)","v":"D1D2D3D4D5D6D7D8"},{"$f":"LEFT($E$24,$E$5-1)","v":""},"Nåbar","Vad","Poäng","PosPoäng","MöjligaDrag"]
["Pjäs:",{"$f":"Logik!H2","v":"D1"},null,"PosDiag1",{"$f":"FIND(B3,E21)","v":9},{"$f":"UPPER(Logik!E1)","v":"A1"},{"$f":"UPPER(F2)","v":"A1"},{"$f":"IF($G2<>\"\",IF($G2<>$B$3,IF(IFERROR(FIND($G2,$E$21)>0,FALSE),TRUE,FALSE),FALSE),FALSE)","v":false},{"$f":"IF(H2,FIND($G2,$E$21),\"\")","v":""},{"$f":"IFERROR(IF(AND($I2<>\"\",$I2>0,$I2>$E$2),LEFT(J1,MIN($I2-$E$2+2,LEN(J1))),J1),J1)","v":"D1"},{"$f":"IF(AND($I2<>\"\",$I2>0,$I2<$E$2),RIGHT(K1,MIN($E$2-$I2,LEN(K1))),K1)","v":"H5G4F3E2"},{"$f":"IF($G2<>\"\",IF($G2<>$B$3,IF(IFERROR(FIND($G2,$E$22)>0,FALSE),TRUE,FALSE),FALSE),FALSE)","v":false},{"$f":"IF(L2,FIND($G2,$E$22),\"\")","v":""},{"$f":"IFERROR(IF(AND($M2<>\"\",$M2>0,$M2>$E$3),LEFT(N1,MIN($M2-$E$3+2,LEN(N1))),N1),N1)","v":"D1C2B3A4"},{"$f":"IF(AND($M2<>\"\",$M2>0,$M2<$E$3),RIGHT(O1,MIN($E$3-$M2,LEN(O1))),O1)","v":""},{"$f":"IF($G2<>\"\",IF($G2<>$B$3,IF(IFERROR(FIND($G2,$E$23)>0,FALSE),TRUE,FALSE),FALSE),FALSE)","v":true},{"$f":"IF(P2,FIND($G2,$E$23),\"\")","v":1},{"$f":"IFERROR(IF(AND($Q2<>\"\",$Q2>0,$Q2>$E$4),LEFT(R1,MIN($Q2-$E$4+2,LEN(R1))),R1),R1)","v":"D1E1F1G1H1"},{"$f":"IF(AND($Q2<>\"\",$Q2>0,$Q2<$E$4),RIGHT(S1,MIN($E$4-$Q2,LEN(S1))),S1)","v":"A1B1C1"},{"$f":"IF($G2<>\"\",IF($G2<>$B$3,IF(IFERROR(FIND($G2,$E$24)>0,FALSE),TRUE,FALSE),FALSE),FALSE)","v":false},{"$f":"IF(T2,FIND($G2,$E$24),\"\")","v":""},{"$f":"IFERROR(IF(AND($U2<>\"\",$U2>0,$U2>$E$5),LEFT(V1,MIN($U2-$E$5+2,LEN(V1))),V1),V1)","v":"D1D2D3D4D5D6D7D8"},{"$f":"IF(AND($U2<>\"\",$U2>0,$U2<$E$5),RIGHT(W1,MIN($E$5-$U2,LEN(W1))),W1)","v":""},{"$f":"IFERROR(IF(AND(G2<>\"\",$G2<>$B$3),FIND(G2,$E$8),\"\"),\"\")","v":""},"A1",{"$f":"IF(X2<>\"\",HLOOKUP(HLOOKUP(Y2,PjasStart,2,FALSE),Pjaser,4,FALSE),0)","v":0},{"$f":"IF(X2<>\"\",OFFSET(Logik!$D$4,0,ROW()-1),0)","v":0},{"$f":"SUBSTITUTE(E8,G2,\"\")","v":"E2D1D1C2C1D1E1D1D2"}]
["Pos:",{"$f":"UPPER(Logik!H1)","v":"D1"},null,"PosDiag2",{"$f":"IFERROR(FIND(B3,E22),0)","v":1},{"$f":"Logik!F1","v":"B1"},{"$f":"UPPER(F3)","v":"B1"},false,"","D1","H5G4F3E2",false,"","D1C2B3A4","",{"$f":"IF($G3<>\"\",IF($G3<>$B$3,IF(IFERROR(FIND($G3,$E$23)>0,FALSE),TRUE,FALSE),FALSE),FALSE)","v":true},{"$f":"IF(P3,FIND($G3,$E$23),\"\")","v":3},{"$f":"IFERROR(IF(AND($Q3<>\"\",$Q3>0,$Q3>$E$4),LEFT(R2,MIN($Q3-$E$4+2,LEN(R2))),R2),R2)","v":"D1E1F1G1H1"},{"$f":"IF(AND($Q3<>\"\",$Q3>0,$Q3<$E$4),RIGHT(S2,MIN($E$4-$Q3,LEN(S2))),S2)","v":"B1C1"},{"$f":"IF($G3<>\"\",IF($G3<>$B$3,IF(IFERROR(FIND($G3,$E$24)>0,FALSE),TRUE,FALSE),FALSE),FALSE)","v":false},{"$f":"IF(T3,FIND($G3,$E$24),\"\")","v":""},{"$f":"IFERROR(IF(AND($U3<>\"\",$U3>0,$U3>$E$5),LEFT(V2,MIN($U3-$E$5+2,LEN(V2))),V2),V2)","v":"D1D2D3D4D5D6D7D8"},{"$f":"IF(AND($U3<>\"\",$U3>0,$U3<$E$5),RIGHT(W2,MIN($E$5-$U3,LEN(W2))),W2)","v":""},{"$f":"IFERROR(IF(AND(G3<>\"\",$G3<>$B$3),FIND(G3,$E$8),\"\"),\"\")","v":""},"B1",0,{"$f":"IF(X3<>\"\",OFFSET(Logik!$D$4,0,ROW()-1),0)","v":0},{"$f":"SUBSTITUTE(AB2,G3,\"\")","v":"E2D1D1C2C1D1E1D1D2"}]
["PosX:",{"$f":"LEFT(B3,1)","v":"D"},null,"PosX",{"$f":"IFERROR(FIND(B3,E23),0)","v":7},{"$f":"Logik!G1","v":"C1"},"C1",false,"","D1","H5G4F3E2",false,"","D1C2B3A4","",true,5,"D1E1F1G1H1","C1",false,"","D1D2D3D4D5D6D7D8","",9,"C1",300,{"$f":"IF(X4<>\"\",OFFSET(Logik!$D$4,0,ROW()-1),0)","v":10},{"$f":"SUBSTITUTE(AB3,G4,\"\")","v":"E2D1D1C2D1E1D1D2"}]
["PosY:",{"$f":"RIGHT(B3,1)","v":"1"},null,"PosY",{"$f":"IFERROR(FIND(B3,E24),0)","v":1},{"$f":"Logik!H1","v":"D1"},"D1",false,"","D1","H5G4F3E2",false,"","D1C2B3A4","",false,"","D1E1F1G1H1","C1",false,"","D1D2D3D4D5D6D7D8","","","D1",0,{"$f":"IF(X5<>\"\",OFFSET(Logik!$D$4,0,ROW()-1),0)","v":0},"E2C2E1D2"]
[null,null,null,"RA",{"$f":"K33&J33&O33&N33","v":"E2D1D1C2"},{"$f":"Logik!I1","v":"E1"},"E1",false,"","D1","H5G4F3E2",false,"","D1C2B3A4","",true,9,"D1E1","C1",false,"","D1D2D3D4D5D6D7D8","",13,"E1",100,{"$f":"IF(X6<>\"\",OFFSET(Logik!$D$4,0,ROW()-1),0)","v":32},"E2C2D2"]
["Poäng",{"$f":"Logik!H3","v":900},null,"RB",{"$f":"S33&R33&W33&V33","v":"C1D1E1D1D2"},{"$f":"Logik!J1","v":"F1"},"F1",false,"","D1","H5G4F3E2",false,"","D1C2B3A4","",true,11,"D1E1","C1",false,"","D1D2D3D4D5D6D7D8","","","F1",0,{"$f":"IF(X7<>\"\",OFFSET(Logik!$D$4,0,ROW()-1),0)","v":0},"E2C2D2"]
["PosPoäng",{"$f":"Logik!H4","v":12},null,"RAB",{"$f":"E6&E7","v":"E2D1D1C2C1D1E1D1D2"},{"$f":"Logik!K1","v":"G1"},"G1",false,"","D1","H5G4F3E2",false,"","D1C2B3A4","",true,13,"D1E1","C1",false,"","D1D2D3D4D5D6D7D8","","","G1",0,{"$f":"IF(X8<>\"\",OFFSET(Logik!$D$4,0,ROW()-1),0)","v":0},"E2C2D2"]
[null,null,null,"Försvar",{"$f":"SUM(Z2:Z17)+SUM(AA2:AA17)","v":742},{"$f":"Logik!L1","v":"H1"},"H1",false,"","D1","H5G4F3E2",false,"","D1C2B3A4","",true,15,"D1E1","C1",false,"","D1D2D3D4D5D6D7D8","","","H1",0,{"$f":"IF(X9<>\"\",OFFSET(Logik!$D$4,0,ROW()-1),0)","v":0},"E2C2D2"]
[null,null,null,"Attack",{"$f":"SUM(Z18:Z33)+SUM(AA18:AA33)","v":0},{"$f":"Logik!M1","v":"A2"},"A2",false,"","D1","H5G4F3E2",false,"","D1C2B3A4","",false,"","D1E1","C1",false,"","D1D2D3D4D5D6D7D8","","","A2",0,{"$f":"IF(X10<>\"\",OFFSET(Logik!$D$4,0,ROW()-1),0)","v":0},"E2C2D2"]
[null,null,null,"R Antal",{"$f":"LEN(E8)/2","v":9},{"$f":"Logik!N1","v":"B2"},"B2",false,"","D1","H5G4F3E2",false,"","D1C2B3A4","",false,"","D1E1","C1",false,"","D1D2D3D4D5D6D7D8","","","B2",0,{"$f":"IF(X11<>\"\",OFFSET(Logik!$D$4,0,ROW()-1),0)","v":0},"E2C2D2"]
[null,null,null,null,null,{"$f":"Logik!O1","v":"C2"},"C2",false,"","D1","H5G4F3E2",true,3,"D1C2","",false,"","D1E1","C1",false,"","D1D2D3D4D5D6D7D8","",7,"C2",100,{"$f":"IF(X12<>\"\",OFFSET(Logik!$D$4,0,ROW()-1),0)","v":0},"E2D2"]
[null,null,null,"FRvA",{"$f":"IFERROR(INDEX(tblRVD,MATCH(\"VD\"&$B$3,RVD!$A$2:$A$65,0),5),\"\")","v":"D1"},{"$f":"Logik!P1","v":"D2"},"D2",false,"","D1","H5G4F3E2",false,"","D1C2","",false,"","D1E1","C1",true,3,"D1D2","",17,"D2",100,{"$f":"IF(X13<>\"\",OFFSET(Logik!$D$4,0,ROW()-1),0)","v":0},"E2"]
[null,null,null,"FRvB",{"$f":"IFERROR(INDEX(tblRVD,MATCH(\"VD\"&$B$3,RVD!$A$2:$A$65,0),6),\"\")","v":"D1C2B3A4"},{"$f":"Logik!Q1","v":"E2"},"E2",true,7,"D1","E2",false,"","D1C2","",false,"","D1E1","C1",false,"","D1D2","",1,"E2",100,{"$f":"IF(X14<>\"\",OFFSET(Logik!$D$4,0,ROW()-1),0)","v":0},""]
[null,null,null,"FRvC",{"$f":"IFERROR(INDEX(tblRVD,MATCH(\"VD\"&$B$3,RVD!$A$2:$A$65,0),7),\"\")","v":""},{"$f":"Logik!R1","v":"F2"},"F2",false,"","D1","E2",false,"","D1C2","",false,"","D1E1","C1",false,"","D1D2","","","F2",0,{"$f":"IF(X15<>\"\",OFFSET(Logik!$D$4,0,ROW()-1),0)","v":0},""]
[null,null,null,"FRvD",{"$f":"IFERROR(INDEX(tblRVD,MATCH(\"VD\"&$B$3,RVD!$A$2:$A$65,0),8),\"\")","v":"H5G4F3E2"},{"$f":"Logik!S1","v":"G2"},"G2",false,"","D1","E2",false,"","D1C2","",false,"","D1E1","C1",false,"","D1D2","","","G2",0,{"$f":"IF(X16<>\"\",OFFSET(Logik!$D$4,0,ROW()-1),0)","v":0},""]
[null,null,null,"FRvE",{"$f":"IFERROR(INDEX(tblRVD,MATCH(\"VD\"&$B$3,RVD!$A$2:$A$65,0),9),\"\")","v":"A1B1C1D1"},{"$f":"Logik!T1","v":"H2"},"H2",false,"","D1","E2",false,"","D1C2","",false,"","D1E1","C1",false,"","D1D2","","","H2",0,{"$f":"IF(X17<>\"\",OFFSET(Logik!$D$4,0,ROW()-1),0)","v":0},""]
[null,null,null,"FRvF",{"$f":"IFERROR(INDEX(tblRVD,MATCH(\"VD\"&$B$3,RVD!$A$2:$A$65,0),10),\"\")","v":"E1F1G1H1"},{"$f":"Logik!U1","v":"A7"},"A7",false,"","D1","E2",false,"","D1C2","",false,"","D1E1","C1",false,"","D1D2","","","A7",{"$f":"IF(X18<>\"\",HLOOKUP(HLOOKUP(Y18,PjasStart,2,FALSE),Pjaser,3,FALSE),0)","v":0},{"$f":"IF(X18<>\"\",OFFSET(Logik!$D$4,0,ROW()-1),0)","v":0}]
[null,null,null,"FRvG",{"$f":"IFERROR(INDEX(tblRVD,MATCH(\"VD\"&$B$3,RVD!$A$2:$A$65,0),11),\"\")","v":"D1"},{"$f":"Logik!V1","v":"B7"},"B7",false,"","D1","E2",false,"","D1C2","",false,"","D1E1","C1",false,"","D1D2","","","B7",0,{"$f":"IF(X19<>\"\",OFFSET(Logik!$D$4,0,ROW()-1),0)","v":0}]
[null,null,null,"FRvH",{"$f":"IFERROR(INDEX(tblRVD,MATCH(\"VD\"&$B$3,RVD!$A$2:$A$65,0),12),\"\")","v":"D2D3D4D5D6D7D8"},{"$f":"Logik!W1","v":"C7"},"C7",false,"","D1","E2",false,"","D1C2","",false,"","D1E1","C1",false,"","D1D2","","","C7",0,{"$f":"IF(X20<>\"\",OFFSET(Logik!$D$4,0,ROW()-1),0)","v":0}]
[null,null,null,"FR1",{"$f":"E16&E13","v":"H5G4F3E2D1"},{"$f":"Logik!X1","v":"D7"},"D7",false,"","D1","E2",false,"","D1C2","",false,"","D1E1","C1",true,13,"D1D2","","","D7",0,{"$f":"IF(X21<>\"\",OFFSET(Logik!$D$4,0,ROW()-1),0)","v":0}]
[null,null,null,"FR2",{"$f":"E15&E14","v":"D1C2B3A4"},{"$f":"Logik!Y1","v":"E7"},"E7",false,"","D1","E2",false,"","D1C2","",false,"","D1E1","C1",false,"","D1D2","","","E7",0,{"$f":"IF(X22<>\"\",OFFSET(Logik!$D$4,0,ROW()-1),0)","v":0}]
[null,null,null,"FR3",{"$f":"E17&E18","v":"A1B1C1D1E1F1G1H1"},{"$f":"Logik!Z1","v":"F7"},"F7",false,"","D1","E2",false,"","D1C2","",false,"","D1E1","C1",false,"","D1D2","","","F7",0,{"$f":"IF(X23<>\"\",OFFSET(Logik!$D$4,0,ROW()-1),0)","v":0}]
[null,null,null,"FR4",{"$f":"E19&E20","v":"D1D2D3D4D5D6D7D8"},{"$f":"Logik!AA1","v":"G7"},"G7",false,"","D1","E2",false,"","D1C2","",false,"","D1E1","C1",false,"","D1D2","","","G7",0,{"$f":"IF(X24<>\"\",OFFSET(Logik!$D$4,0,ROW()-1),0)","v":0}]
[null,null,null,null,null,{"$f":"Logik!AB1","v":"H7"},"H7",false,"","D1","E2",false,"","D1C2","",false,"","D1E1","C1",false,"","D1D2","","","H7",0,{"$f":"IF(X25<>\"\",OFFSET(Logik!$D$4,0,ROW()-1),0)","v":0}]
[null,null,null,"MöjligaDrag",{"$f":"AB17","v":""},{"$f":"Logik!AC1","v":"A8"},"A8",false,"","D1","E2",false,"","D1C2","",false,"","D1E1","C1",false,"","D1D2","","","A8",0,{"$f":"IF(X26<>\"\",OFFSET(Logik!$D$4,0,ROW()-1),0)","v":0}]
[null,null,null,"D Antal",{"$f":"LEN(E26)/2","v":0},{"$f":"Logik!AD1","v":"B8"},"B8",false,"","D1","E2",false,"","D1C2","",false,"","D1E1","C1",false,"","D1D2","","","B8",0,{"$f":"IF(X27<>\"\",OFFSET(Logik!$D$4,0,ROW()-1),0)","v":0}]
[null,null,null,null,null,{"$f":"Logik!AE1","v":"C8"},"C8",false,"","D1","E2",false,"","D1C2","",false,"","D1E1","C1",false,"","D1D2","","","C8",0,{"$f":"IF(X28<>\"\",OFFSET(Logik!$D$4,0,ROW()-1),0)","v":0}]
[null,null,null,null,null,{"$f":"Logik!AF1","v":"D8"},"D8",false,"","D1","E2",false,"","D1C2","",false,"","D1E1","C1",true,15,"D1D2","","","D8",0,{"$f":"IF(X29<>\"\",OFFSET(Logik!$D$4,0,ROW()-1),0)","v":0}]
[null,null,null,null,null,{"$f":"Logik!AG1","v":"E8"},"E8",false,"","D1","E2",false,"","D1C2","",false,"","D1E1","C1",false,"","D1D2","","","E8",0,{"$f":"IF(X30<>\"\",OFFSET(Logik!$D$4,0,ROW()-1),0)","v":0}]
[null,null,null,null,null,{"$f":"Logik!AH1","v":"F8"},"F8",false,"","D1","E2",false,"","D1C2","",false,"","D1E1","C1",false,"","D1D2","","","F8",0,{"$f":"IF(X31<>\"\",OFFSET(Logik!$D$4,0,ROW()-1),0)","v":0}]
[null,null,null,null,null,{"$f":"Logik!AI1","v":"G8"},"G8",false,"","D1","E2",false,"","D1C2","",false,"","D1E1","C1",false,"","D1D2","","","G8",0,{"$f":"IF(X32<>\"\",OFFSET(Logik!$D$4,0,ROW()-1),0)","v":0}]
[null,null,null,null,null,{"$f":"Logik!AJ1","v":"H8"},"H8",false,"","D1","E2",false,"","D1C2","",false,"","D1E1","C1",false,"","D1D2","","","H8",0,{"$f":"IF(X33<>\"\",OFFSET(Logik!$D$4,0,ROW()-1),0)","v":0}]

{"sheet":"P_E1","index":17,"n_rows":33,"n_cols":28,"rows_kept":33,"cut":false,"hidden":true,"merged":[]}
[null,null,null,null,null,{"$f":"Logik!D1","v":"Pos:"},"Pjäs:","Diagonal1","Pos",{"$f":"RIGHT($E$21,LEN($E$21)-$E$2+1)","v":"E1F2"},{"$f":"LEFT($E$21,$E$2-1)","v":""},"Diagonal2","Pos",{"$f":"RIGHT($E$22,LEN($E$22)-$E$3+1)","v":"E1F1"},{"$f":"LEFT($E$22,$E$3-1)","v":"D1"},"Rät1","Pos",{"$f":"RIGHT($E$23,LEN($E$23)-$E$4+1)","v":"E1"},{"$f":"LEFT($E$23,$E$4-1)","v":"D2"},"Rät2","Pos",{"$f":"RIGHT($E$24,LEN($E$24)-$E$5+1)","v":"E1"},{"$f":"LEFT($E$24,$E$5-1)","v":"E2"},"Nåbar","Vad","Poäng","PosPoäng","MöjligaDrag"]
["Pjäs:",{"$f":"Logik!I2","v":"E1"},null,"PosDiag1",{"$f":"FIND(B3,E21)","v":1},{"$f":"UPPER(Logik!E1)","v":"A1"},{"$f":"UPPER(F2)","v":"A1"},{"$f":"IF($G2<>\"\",IF($G2<>$B$3,IF(IFERROR(FIND($G2,$E$21)>0,FALSE),TRUE,FALSE),FALSE),FALSE)","v":false},{"$f":"IF(H2,FIND($G2,$E$21),\"\")","v":""},{"$f":"IFERROR(IF(AND($I2<>\"\",$I2>0,$I2>$E$2),LEFT(J1,MIN($I2-$E$2+2,LEN(J1))),J1),J1)","v":"E1F2"},{"$f":"IF(AND($I2<>\"\",$I2>0,$I2<$E$2),RIGHT(K1,MIN($E$2-$I2,LEN(K1))),K1)","v":""},{"$f":"IF($G2<>\"\",IF($G2<>$B$3,IF(IFERROR(FIND($G2,$E$22)>0,FALSE),TRUE,FALSE),FALSE),FALSE)","v":false},{"$f":"IF(L2,FIND($G2,$E$22),\"\")","v":""},{"$f":"IFERROR(IF(AND($M2<>\"\",$M2>0,$M2>$E$3),LEFT(N1,MIN($M2-$E$3+2,LEN(N1))),N1),N1)","v":"E1F1"},{"$f":"IF(AND($M2<>\"\",$M2>0,$M2<$E$3),RIGHT(O1,MIN($E$3-$M2,LEN(O1))),O1)","v":"D1"},{"$f":"IF($G2<>\"\",IF($G2<>$B$3,IF(IFERROR(FIND($G2,$E$23)>0,FALSE),TRUE,FALSE),FALSE),FALSE)","v":false},{"$f":"IF(P2,FIND($G2,$E$23),\"\")","v":""},{"$f":"IFERROR(IF(AND($Q2<>\"\",$Q2>0,$Q2>$E$4),LEFT(R1,MIN($Q2-$E$4+2,LEN(R1))),R1),R1)","v":"E1"},{"$f":"IF(AND($Q2<>\"\",$Q2>0,$Q2<$E$4),RIGHT(S1,MIN($E$4-$Q2,LEN(S1))),S1)","v":"D2"},{"$f":"IF($G2<>\"\",IF($G2<>$B$3,IF(IFERROR(FIND($G2,$E$24)>0,FALSE),TRUE,FALSE),FALSE),FALSE)","v":false},{"$f":"IF(T2,FIND($G2,$E$24),\"\")","v":""},{"$f":"IFERROR(IF(AND($U2<>\"\",$U2>0,$U2>$E$5),LEFT(V1,MIN($U2-$E$5+2,LEN(V1))),V1),V1)","v":"E1"},{"$f":"IF(AND($U2<>\"\",$U2>0,$U2<$E$5),RIGHT(W1,MIN($E$5-$U2,LEN(W1))),W1)","v":"E2"},{"$f":"IFERROR(IF(AND(G2<>\"\",$G2<>$B$3),FIND(G2,$E$8),\"\"),\"\")","v":""},"A1",{"$f":"IF(X2<>\"\",HLOOKUP(HLOOKUP(Y2,PjasStart,2,FALSE),Pjaser,4,FALSE),0)","v":0},{"$f":"IF(X2<>\"\",OFFSET(Logik!$D$4,0,ROW()-1),0)","v":0},{"$f":"SUBSTITUTE(E8,G2,\"\")","v":"E1F2D1E1F1D2E1E2E1"}]
["Pos:",{"$f":"UPPER(Logik!I1)","v":"E1"},null,"PosDiag2",{"$f":"IFERROR(FIND(B3,E22),0)","v":3},{"$f":"Logik!F1","v":"B1"},{"$f":"UPPER(F3)","v":"B1"},false,"","E1F2","",false,"","E1F1","D1",{"$f":"IF($G3<>\"\",IF($G3<>$B$3,IF(IFERROR(FIND($G3,$E$23)>0,FALSE),TRUE,FALSE),FALSE),FALSE)","v":false},{"$f":"IF(P3,FIND($G3,$E$23),\"\")","v":""},{"$f":"IFERROR(IF(AND($Q3<>\"\",$Q3>0,$Q3>$E$4),LEFT(R2,MIN($Q3-$E$4+2,LEN(R2))),R2),R2)","v":"E1"},{"$f":"IF(AND($Q3<>\"\",$Q3>0,$Q3<$E$4),RIGHT(S2,MIN($E$4-$Q3,LEN(S2))),S2)","v":"D2"},{"$f":"IF($G3<>\"\",IF($G3<>$B$3,IF(IFERROR(FIND($G3,$E$24)>0,FALSE),TRUE,FALSE),FALSE),FALSE)","v":false},{"$f":"IF(T3,FIND($G3,$E$24),\"\")","v":""},{"$f":"IFERROR(IF(AND($U3<>\"\",$U3>0,$U3>$E$5),LEFT(V2,MIN($U3-$E$5+2,LEN(V2))),V2),V2)","v":"E1"},{"$f":"IF(AND($U3<>\"\",$U3>0,$U3<$E$5),RIGHT(W2,MIN($E$5-$U3,LEN(W2))),W2)","v":"E2"},{"$f":"IFERROR(IF(AND(G3<>\"\",$G3<>$B$3),FIND(G3,$E$8),\"\"),\"\")","v":""},"B1",0,{"$f":"IF(X3<>\"\",OFFSET(Logik!$D$4,0,ROW()-1),0)","v":0},{"$f":"SUBSTITUTE(AB2,G3,\"\")","v":"E1F2D1E1F1D2E1E2E1"}]
["PosX:",{"$f":"LEFT(B3,1)","v":"E"},null,"PosX",{"$f":"IFERROR(FIND(B3,E23),0)","v":3},{"$f":"Logik!G1","v":"C1"},"C1",false,"","E1F2","",false,"","E1F1","D1",false,"","E1","D2",false,"","E1","E2","","C1",0,{"$f":"IF(X4<>\"\",OFFSET(Logik!$D$4,0,ROW()-1),0)","v":0},{"$f":"SUBSTITUTE(AB3,G4,\"\")","v":"E1F2D1E1F1D2E1E2E1"}]
["PosY:",{"$f":"RIGHT(B3,1)","v":"1"},null,"PosY",{"$f":"IFERROR(FIND(B3,E24),0)","v":3},{"$f":"Logik!H1","v":"D1"},"D1",false,"","E1F2","",true,1,"E1F1","D1",false,"","E1","D2",false,"","E1","E2",5,"D1",900,{"$f":"IF(X5<>\"\",OFFSET(Logik!$D$4,0,ROW()-1),0)","v":12},"E1F2E1F1D2E1E2E1"]
[null,null,null,"RA",{"$f":"K33&J33&O33&N33","v":"E1F2D1E1F1"},{"$f":"Logik!I1","v":"E1"},"E1",false,"","E1F2","",false,"","E1F1","D1",false,"","E1","D2",false,"","E1","E2","","E1",0,{"$f":"IF(X6<>\"\",OFFSET(Logik!$D$4,0,ROW()-1),0)","v":0},"F2F1D2E2"]
["Poäng",{"$f":"Logik!I3","v":20000},null,"RB",{"$f":"S33&R33&W33&V33","v":"D2E1E2E1"},{"$f":"Logik!J1","v":"F1"},"F1",false,"","E1F2","",true,5,"E1F1","D1",false,"","E1","D2",false,"","E1","E2",9,"F1",300,{"$f":"IF(X7<>\"\",OFFSET(Logik!$D$4,0,ROW()-1),0)","v":10},"F2D2E2"]
["PosPoäng",{"$f":"Logik!I4","v":32},null,"RAB",{"$f":"E6&E7","v":"E1F2D1E1F1D2E1E2E1"},{"$f":"Logik!K1","v":"G1"},"G1",false,"","E1F2","",false,"","E1F1","D1",false,"","E1","D2",false,"","E1","E2","","G1",0,{"$f":"IF(X8<>\"\",OFFSET(Logik!$D$4,0,ROW()-1),0)","v":0},"F2D2E2"]
[null,null,null,"Försvar",{"$f":"SUM(Z2:Z17)+SUM(AA2:AA17)","v":1522},{"$f":"Logik!L1","v":"H1"},"H1",false,"","E1F2","",false,"","E1F1","D1",false,"","E1","D2",false,"","E1","E2","","H1",0,{"$f":"IF(X9<>\"\",OFFSET(Logik!$D$4,0,ROW()-1),0)","v":0},"F2D2E2"]
[null,null,null,"Attack",{"$f":"SUM(Z18:Z33)+SUM(AA18:AA33)","v":0},{"$f":"Logik!M1","v":"A2"},"A2",false,"","E1F2","",false,"","E1F1","D1",false,"","E1","D2",false,"","E1","E2","","A2",0,{"$f":"IF(X10<>\"\",OFFSET(Logik!$D$4,0,ROW()-1),0)","v":0},"F2D2E2"]
[null,null,null,"R Antal",{"$f":"LEN(E8)/2","v":9},{"$f":"Logik!N1","v":"B2"},"B2",false,"","E1F2","",false,"","E1F1","D1",false,"","E1","D2",false,"","E1","E2","","B2",0,{"$f":"IF(X11<>\"\",OFFSET(Logik!$D$4,0,ROW()-1),0)","v":0},"F2D2E2"]
[null,null,null,null,null,{"$f":"Logik!O1","v":"C2"},"C2",false,"","E1F2","",false,"","E1F1","D1",false,"","E1","D2",false,"","E1","E2","","C2",0,{"$f":"IF(X12<>\"\",OFFSET(Logik!$D$4,0,ROW()-1),0)","v":0},"F2D2E2"]
[null,null,null,"FRvA",{"$f":"IFERROR(INDEX(tblRVK,MATCH(\"VK\"&$B$3,RVK!$A$2:$A$65,0),6),\"\")","v":""},{"$f":"Logik!P1","v":"D2"},"D2",false,"","E1F2","",false,"","E1F1","D1",true,1,"E1","D2",false,"","E1","E2",11,"D2",100,{"$f":"IF(X13<>\"\",OFFSET(Logik!$D$4,0,ROW()-1),0)","v":0},"F2E2"]
[null,null,null,"FRvB",{"$f":"IFERROR(INDEX(tblRVK,MATCH(\"VK\"&$B$3,RVK!$A$2:$A$65,0),7),\"\")","v":""},{"$f":"Logik!Q1","v":"E2"},"E2",false,"","E1F2","",false,"","E1F1","D1",false,"","E1","D2",true,1,"E1","E2",15,"E2",100,{"$f":"IF(X14<>\"\",OFFSET(Logik!$D$4,0,ROW()-1),0)","v":0},"F2"]
[null,null,null,"FRvC",{"$f":"IFERROR(INDEX(tblRVK,MATCH(\"VK\"&$B$3,RVK!$A$2:$A$65,0),8),\"\")","v":"F1"},{"$f":"Logik!R1","v":"F2"},"F2",true,3,"E1F2","",false,"","E1F1","D1",false,"","E1","D2",false,"","E1","E2",3,"F2",100,{"$f":"IF(X15<>\"\",OFFSET(Logik!$D$4,0,ROW()-1),0)","v":0},""]
[null,null,null,"FRvD",{"$f":"IFERROR(INDEX(tblRVK,MATCH(\"VK\"&$B$3,RVK!$A$2:$A$65,0),9),\"\")","v":"F2"},{"$f":"Logik!S1","v":"G2"},"G2",false,"","E1F2","",false,"","E1F1","D1",false,"","E1","D2",false,"","E1","E2","","G2",0,{"$f":"IF(X16<>\"\",OFFSET(Logik!$D$4,0,ROW()-1),0)","v":0},""]
[null,null,null,"FRvE",{"$f":"IFERROR(INDEX(tblRVK,MATCH(\"VK\"&$B$3,RVK!$A$2:$A$65,0),10),\"\")","v":"E2"},{"$f":"Logik!T1","v":"H2"},"H2",false,"","E1F2","",false,"","E1F1","D1",false,"","E1","D2",false,"","E1","E2","","H2",0,{"$f":"IF(X17<>\"\",OFFSET(Logik!$D$4,0,ROW()-1),0)","v":0},""]
[null,null,null,"FRvF",{"$f":"IFERROR(INDEX(tblRVK,MATCH(\"VK\"&$B$3,RVK!$A$2:$A$65,0),11),\"\")","v":"D2"},{"$f":"Logik!U1","v":"A7"},"A7",false,"","E1F2","",false,"","E1F1","D1",false,"","E1","D2",false,"","E1","E2","","A7",{"$f":"IF(X18<>\"\",HLOOKUP(HLOOKUP(Y18,PjasStart,2,FALSE),Pjaser,3,FALSE),0)","v":0},{"$f":"IF(X18<>\"\",OFFSET(Logik!$D$4,0,ROW()-1),0)","v":0}]
[null,null,null,"FRvG",{"$f":"IFERROR(INDEX(tblRVK,MATCH(\"VK\"&$B$3,RVK!$A$2:$A$65,0),12),\"\")","v":"D1"},{"$f":"Logik!V1","v":"B7"},"B7",false,"","E1F2","",false,"","E1F1","D1",false,"","E1","D2",false,"","E1","E2","","B7",0,{"$f":"IF(X19<>\"\",OFFSET(Logik!$D$4,0,ROW()-1),0)","v":0}]
[null,null,null,"FRvH",{"$f":"IFERROR(INDEX(tblRVK,MATCH(\"VK\"&$B$3,RVK!$A$2:$A$65,0),13),\"\")","v":""},{"$f":"Logik!W1","v":"C7"},"C7",false,"","E1F2","",false,"","E1F1","D1",false,"","E1","D2",false,"","E1","E2","","C7",0,{"$f":"IF(X20<>\"\",OFFSET(Logik!$D$4,0,ROW()-1),0)","v":0}]
[null,null,null,"FR1",{"$f":"E20&B3&E16","v":"E1F2"},{"$f":"Logik!X1","v":"D7"},"D7",false,"","E1F2","",false,"","E1F1","D1",false,"","E1","D2",false,"","E1","E2","","D7",0,{"$f":"IF(X21<>\"\",OFFSET(Logik!$D$4,0,ROW()-1),0)","v":0}]
[null,null,null,"FR2",{"$f":"E19&B3&E15","v":"D1E1F1"},{"$f":"Logik!Y1","v":"E7"},"E7",false,"","E1F2","",false,"","E1F1","D1",false,"","E1","D2",false,"","E1","E2","","E7",0,{"$f":"IF(X22<>\"\",OFFSET(Logik!$D$4,0,ROW()-1),0)","v":0}]
[null,null,null,"FR3",{"$f":"E18&B3&E14","v":"D2E1"},{"$f":"Logik!Z1","v":"F7"},"F7",false,"","E1F2","",false,"","E1F1","D1",false,"","E1","D2",false,"","E1","E2","","F7",0,{"$f":"IF(X23<>\"\",OFFSET(Logik!$D$4,0,ROW()-1),0)","v":0}]
[null,null,null,"FR4",{"$f":"E17&B3&E13","v":"E2E1"},{"$f":"Logik!AA1","v":"G7"},"G7",false,"","E1F2","",false,"","E1F1","D1",false,"","E1","D2",false,"","E1","E2","","G7",0,{"$f":"IF(X24<>\"\",OFFSET(Logik!$D$4,0,ROW()-1),0)","v":0}]
[null,null,null,null,null,{"$f":"Logik!AB1","v":"H7"},"H7",false,"","E1F2","",false,"","E1F1","D1",false,"","E1","D2",false,"","E1","E2","","H7",0,{"$f":"IF(X25<>\"\",OFFSET(Logik!$D$4,0,ROW()-1),0)","v":0}]
[null,null,null,"MöjligaDrag",{"$f":"AB17","v":""},{"$f":"Logik!AC1","v":"A8"},"A8",false,"","E1F2","",false,"","E1F1","D1",false,"","E1","D2",false,"","E1","E2","","A8",0,{"$f":"IF(X26<>\"\",OFFSET(Logik!$D$4,0,ROW()-1),0)","v":0}]
[null,null,null,"D Antal",{"$f":"LEN(E26)/2","v":0},{"$f":"Logik!AD1","v":"B8"},"B8",false,"","E1F2","",false,"","E1F1","D1",false,"","E1","D2",false,"","E1","E2","","B8",0,{"$f":"IF(X27<>\"\",OFFSET(Logik!$D$4,0,ROW()-1),0)","v":0}]
[null,null,null,null,null,{"$f":"Logik!AE1","v":"C8"},"C8",false,"","E1F2","",false,"","E1F1","D1",false,"","E1","D2",false,"","E1","E2","","C8",0,{"$f":"IF(X28<>\"\",OFFSET(Logik!$D$4,0,ROW()-1),0)","v":0}]
[null,null,null,null,null,{"$f":"Logik!AF1","v":"D8"},"D8",false,"","E1F2","",false,"","E1F1","D1",false,"","E1","D2",false,"","E1","E2","","D8",0,{"$f":"IF(X29<>\"\",OFFSET(Logik!$D$4,0,ROW()-1),0)","v":0}]
[null,null,null,null,null,{"$f":"Logik!AG1","v":"E8"},"E8",false,"","E1F2","",false,"","E1F1","D1",false,"","E1","D2",false,"","E1","E2","","E8",0,{"$f":"IF(X30<>\"\",OFFSET(Logik!$D$4,0,ROW()-1),0)","v":0}]
[null,null,null,null,null,{"$f":"Logik!AH1","v":"F8"},"F8",false,"","E1F2","",false,"","E1F1","D1",false,"","E1","D2",false,"","E1","E2","","F8",0,{"$f":"IF(X31<>\"\",OFFSET(Logik!$D$4,0,ROW()-1),0)","v":0}]
[null,null,null,null,null,{"$f":"Logik!AI1","v":"G8"},"G8",false,"","E1F2","",false,"","E1F1","D1",false,"","E1","D2",false,"","E1","E2","","G8",0,{"$f":"IF(X32<>\"\",OFFSET(Logik!$D$4,0,ROW()-1),0)","v":0}]
[null,null,null,null,null,{"$f":"Logik!AJ1","v":"H8"},"H8",false,"","E1F2","",false,"","E1F1","D1",false,"","E1","D2",false,"","E1","E2","","H8",0,{"$f":"IF(X33<>\"\",OFFSET(Logik!$D$4,0,ROW()-1),0)","v":0}]

{"sheet":"P_F1","index":18,"n_rows":33,"n_cols":20,"rows_kept":33,"cut":false,"hidden":true,"merged":[]}
[null,null,null,null,null,{"$f":"Logik!D1","v":"Pos:"},"Pjäs:","Fräckvidd","Pos",{"$f":"RIGHT($E$23,LEN($E$23)-$E$4+1)","v":"F1"},{"$f":"LEFT($E$23,$E$4-1)","v":"H3G2"},"Fräckvidd","Pos",{"$f":"RIGHT($E$24,LEN($E$24)-$E$5+1)","v":"F1E2D3C4B5A6"},{"$f":"LEFT($E$24,$E$5-1)","v":""},"Nåbar","Vad","Poäng","PosPoäng","MöjligaDrag"]
["Pjäs:",{"$f":"Logik!J2","v":"F1"},null,null,null,{"$f":"UPPER(Logik!E1)","v":"A1"},{"$f":"UPPER(F2)","v":"A1"},{"$f":"IF($G2<>\"\",IF($G2<>$B$3,IF(IFERROR(FIND($G2,$E$23)>0,FALSE),TRUE,FALSE),FALSE),FALSE)","v":false},{"$f":"IF(H2,FIND($G2,$E$23),\"\")","v":""},{"$f":"IFERROR(IF(AND($I2<>\"\",$I2>0,$I2>$E$4),LEFT(J1,MIN($I2-$E$4+2,LEN(J1))),J1),J1)","v":"F1"},{"$f":"IF(AND($I2<>\"\",$I2>0,$I2<$E$4),RIGHT(K1,MIN($E$4-$I2,LEN(K1))),K1)","v":"H3G2"},{"$f":"IF($G2<>\"\",IF($G2<>$B$3,IF(IFERROR(FIND($G2,$E$24)>0,FALSE),TRUE,FALSE),FALSE),FALSE)","v":false},{"$f":"IF(L2,FIND($G2,$E$24),\"\")","v":""},{"$f":"IFERROR(IF(AND($M2<>\"\",$M2>0,$M2>$E$5),LEFT(N1,MIN($M2-$E$5+2,LEN(N1))),N1),N1)","v":"F1E2D3C4B5A6"},{"$f":"IF(AND($M2<>\"\",$M2>0,$M2<$E$5),RIGHT(O1,MIN($E$5-$M2,LEN(O1))),O1)","v":""},{"$f":"IFERROR(IF(AND(G2<>\"\",$G2<>$B$3),FIND(G2,$E$8),\"\"),\"\")","v":""},"A1",{"$f":"IF(P2<>\"\",HLOOKUP(HLOOKUP(Q2,PjasStart,2,FALSE),Pjaser,4,FALSE),0)","v":0},{"$f":"IF(P2<>\"\",OFFSET(Logik!$D$4,0,ROW()-1),0)","v":0},{"$f":"SUBSTITUTE(E8,G2,\"\")","v":"G2F1F1E2"}]
["Pos:",{"$f":"UPPER(Logik!J1)","v":"F1"},null,null,null,{"$f":"Logik!F1","v":"B1"},{"$f":"UPPER(F3)","v":"B1"},{"$f":"IF($G3<>\"\",IF($G3<>$B$3,IF(IFERROR(FIND($G3,$E$23)>0,FALSE),TRUE,FALSE),FALSE),FALSE)","v":false},{"$f":"IF(H3,FIND($G3,$E$23),\"\")","v":""},{"$f":"IFERROR(IF(AND($I3<>\"\",$I3>0,$I3>$E$4),LEFT(J2,MIN($I3-$E$4+2,LEN(J2))),J2),J2)","v":"F1"},{"$f":"IF(AND($I3<>\"\",$I3>0,$I3<$E$4),RIGHT(K2,MIN($E$4-$I3,LEN(K2))),K2)","v":"H3G2"},{"$f":"IF($G3<>\"\",IF($G3<>$B$3,IF(IFERROR(FIND($G3,$E$24)>0,FALSE),TRUE,FALSE),FALSE),FALSE)","v":false},{"$f":"IF(L3,FIND($G3,$E$24),\"\")","v":""},{"$f":"IFERROR(IF(AND($M3<>\"\",$M3>0,$M3>$E$5),LEFT(N2,MIN($M3-$E$5+2,LEN(N2))),N2),N2)","v":"F1E2D3C4B5A6"},{"$f":"IF(AND($M3<>\"\",$M3>0,$M3<$E$5),RIGHT(O2,MIN($E$5-$M3,LEN(O2))),O2)","v":""},{"$f":"IFERROR(IF(AND(G3<>\"\",$G3<>$B$3),FIND(G3,$E$8),\"\"),\"\")","v":""},"B1",0,{"$f":"IF(P3<>\"\",OFFSET(Logik!$D$4,0,ROW()-1),0)","v":0},{"$f":"SUBSTITUTE(T2,G3,\"\")","v":"G2F1F1E2"}]
["PosX:",{"$f":"LEFT(B3,1)","v":"F"},null,"PosX",{"$f":"FIND(B3,E23)","v":5},{"$f":"Logik!G1","v":"C1"},"C1",false,"","F1","H3G2",false,"","F1E2D3C4B5A6","","","C1",0,{"$f":"IF(P4<>\"\",OFFSET(Logik!$D$4,0,ROW()-1),0)","v":0},{"$f":"SUBSTITUTE(T3,G4,\"\")","v":"G2F1F1E2"}]
["PosY:",{"$f":"RIGHT(B3,1)","v":"1"},null,"PosY",{"$f":"IFERROR(FIND(B3,E24),0)","v":1},{"$f":"Logik!H1","v":"D1"},"D1",false,"","F1","H3G2",false,"","F1E2D3C4B5A6","","","D1",0,{"$f":"IF(P5<>\"\",OFFSET(Logik!$D$4,0,ROW()-1),0)","v":0},"G2F1F1E2"]
[null,null,null,"RA",{"$f":"K33&J33","v":"G2F1"},{"$f":"Logik!I1","v":"E1"},"E1",false,"","F1","H3G2",false,"","F1E2D3C4B5A6","","","E1",0,{"$f":"IF(P6<>\"\",OFFSET(Logik!$D$4,0,ROW()-1),0)","v":0},"G2F1F1E2"]
["Poäng",{"$f":"Logik!J3","v":300},null,"RB",{"$f":"O33&N33","v":"F1E2"},{"$f":"Logik!J1","v":"F1"},"F1",false,"","F1","H3G2",false,"","F1E2D3C4B5A6","","","F1",0,{"$f":"IF(P7<>\"\",OFFSET(Logik!$D$4,0,ROW()-1),0)","v":0},"G2E2"]
["PosPoäng",{"$f":"Logik!J4","v":10},null,"RAB",{"$f":"E6&E7","v":"G2F1F1E2"},{"$f":"Logik!K1","v":"G1"},"G1",false,"","F1","H3G2",false,"","F1E2D3C4B5A6","","","G1",0,{"$f":"IF(P8<>\"\",OFFSET(Logik!$D$4,0,ROW()-1),0)","v":0},"G2E2"]
[null,null,null,"Försvar",{"$f":"SUM(R2:R17)+SUM(S2:S17)","v":200},{"$f":"Logik!L1","v":"H1"},"H1",false,"","F1","H3G2",false,"","F1E2D3C4B5A6","","","H1",0,{"$f":"IF(P9<>\"\",OFFSET(Logik!$D$4,0,ROW()-1),0)","v":0},"G2E2"]
[null,null,null,"Attack",{"$f":"SUM(R18:R33)+SUM(S18:S33)","v":0},{"$f":"Logik!M1","v":"A2"},"A2",false,"","F1","H3G2",false,"","F1E2D3C4B5A6","","","A2",0,{"$f":"IF(P10<>\"\",OFFSET(Logik!$D$4,0,ROW()-1),0)","v":0},"G2E2"]
[null,null,null,"R Antal",{"$f":"LEN(E8)/2","v":4},{"$f":"Logik!N1","v":"B2"},"B2",false,"","F1","H3G2",false,"","F1E2D3C4B5A6","","","B2",0,{"$f":"IF(P11<>\"\",OFFSET(Logik!$D$4,0,ROW()-1),0)","v":0},"G2E2"]
[null,null,null,null,null,{"$f":"Logik!O1","v":"C2"},"C2",false,"","F1","H3G2",false,"","F1E2D3C4B5A6","","","C2",0,{"$f":"IF(P12<>\"\",OFFSET(Logik!$D$4,0,ROW()-1),0)","v":0},"G2E2"]
[null,null,null,"FRvA",{"$f":"IFERROR(INDEX(tblRVL,MATCH(\"VL\"&$B$3,RVL!$A$2:$A$129,0),5),\"\")","v":"F1"},{"$f":"Logik!P1","v":"D2"},"D2",false,"","F1","H3G2",false,"","F1E2D3C4B5A6","","","D2",0,{"$f":"IF(P13<>\"\",OFFSET(Logik!$D$4,0,ROW()-1),0)","v":0},"G2E2"]
[null,null,null,"FRvB",{"$f":"IFERROR(INDEX(tblRVL,MATCH(\"VL\"&$B$3,RVL!$A$2:$A$129,0),6),\"\")","v":"F1E2D3C4B5A6"},{"$f":"Logik!Q1","v":"E2"},"E2",false,"","F1","H3G2",true,3,"F1E2","",7,"E2",100,{"$f":"IF(P14<>\"\",OFFSET(Logik!$D$4,0,ROW()-1),0)","v":0},"G2"]
[null,null,null,"FRvC",{"$f":"IFERROR(INDEX(tblRVL,MATCH(\"VL\"&$B$3,RVL!$A$2:$A$129,0),7),\"\")","v":""},{"$f":"Logik!R1","v":"F2"},"F2",false,"","F1","H3G2",false,"","F1E2","","","F2",0,{"$f":"IF(P15<>\"\",OFFSET(Logik!$D$4,0,ROW()-1),0)","v":0},"G2"]
[null,null,null,"FRvD",{"$f":"IFERROR(INDEX(tblRVL,MATCH(\"VL\"&$B$3,RVL!$A$2:$A$129,0),8),\"\")","v":"H3G2"},{"$f":"Logik!S1","v":"G2"},"G2",true,3,"F1","G2",false,"","F1E2","",1,"G2",100,{"$f":"IF(P16<>\"\",OFFSET(Logik!$D$4,0,ROW()-1),0)","v":0},""]
[null,null,null,null,null,{"$f":"Logik!T1","v":"H2"},"H2",false,"","F1","G2",false,"","F1E2","","","H2",0,{"$f":"IF(P17<>\"\",OFFSET(Logik!$D$4,0,ROW()-1),0)","v":0},""]
[null,null,null,"ARvA",{"$f":"IFERROR(INDEX(tblRVL,MATCH(\"VL\"&$B$3,RVL!$A$2:$A$129,0),9),\"\")","v":""},{"$f":"Logik!U1","v":"A7"},"A7",false,"","F1","G2",false,"","F1E2","","","A7",{"$f":"IF(P18<>\"\",HLOOKUP(HLOOKUP(Q18,PjasStart,2,FALSE),Pjaser,3,FALSE),0)","v":0},{"$f":"IF(P18<>\"\",OFFSET(Logik!$D$4,0,ROW()-1),0)","v":0}]
[null,null,null,"ARvB",{"$f":"IFERROR(INDEX(tblRVL,MATCH(\"VL\"&$B$3,RVL!$A$2:$A$129,0),10),\"\")","v":"E2D3C4B5A6"},{"$f":"Logik!V1","v":"B7"},"B7",false,"","F1","G2",false,"","F1E2","","","B7",0,{"$f":"IF(P19<>\"\",OFFSET(Logik!$D$4,0,ROW()-1),0)","v":0}]
[null,null,null,"ARvC",{"$f":"IFERROR(INDEX(tblRVL,MATCH(\"VL\"&$B$3,RVL!$A$2:$A$129,0),11),\"\")","v":""},{"$f":"Logik!W1","v":"C7"},"C7",false,"","F1","G2",false,"","F1E2","","","C7",0,{"$f":"IF(P20<>\"\",OFFSET(Logik!$D$4,0,ROW()-1),0)","v":0}]
[null,null,null,"ARvD",{"$f":"IFERROR(INDEX(tblRVL,MATCH(\"VL\"&$B$3,RVL!$A$2:$A$129,0),12),\"\")","v":"H3G2"},{"$f":"Logik!X1","v":"D7"},"D7",false,"","F1","G2",false,"","F1E2","","","D7",0,{"$f":"IF(P21<>\"\",OFFSET(Logik!$D$4,0,ROW()-1),0)","v":0}]
[null,null,null,null,null,{"$f":"Logik!Y1","v":"E7"},"E7",false,"","F1","G2",false,"","F1E2","","","E7",0,{"$f":"IF(P22<>\"\",OFFSET(Logik!$D$4,0,ROW()-1),0)","v":0}]
[null,null,null,"FR1",{"$f":"E16&E13","v":"H3G2F1"},{"$f":"Logik!Z1","v":"F7"},"F7",false,"","F1","G2",false,"","F1E2","","","F7",0,{"$f":"IF(P23<>\"\",OFFSET(Logik!$D$4,0,ROW()-1),0)","v":0}]
[null,null,null,"FR2",{"$f":"E15&E14","v":"F1E2D3C4B5A6"},{"$f":"Logik!AA1","v":"G7"},"G7",false,"","F1","G2",false,"","F1E2","","","G7",0,{"$f":"IF(P24<>\"\",OFFSET(Logik!$D$4,0,ROW()-1),0)","v":0}]
[null,null,null,null,null,{"$f":"Logik!AB1","v":"H7"},"H7",false,"","F1","G2",false,"","F1E2","","","H7",0,{"$f":"IF(P25<>\"\",OFFSET(Logik!$D$4,0,ROW()-1),0)","v":0}]
[null,null,null,"MöjligaDrag",{"$f":"T17","v":""},{"$f":"Logik!AC1","v":"A8"},"A8",false,"","F1","G2",false,"","F1E2","","","A8",0,{"$f":"IF(P26<>\"\",OFFSET(Logik!$D$4,0,ROW()-1),0)","v":0}]
[null,null,null,"D Antal",{"$f":"LEN(E26)/2","v":0},{"$f":"Logik!AD1","v":"B8"},"B8",false,"","F1","G2",false,"","F1E2","","","B8",0,{"$f":"IF(P27<>\"\",OFFSET(Logik!$D$4,0,ROW()-1),0)","v":0}]
[null,null,null,null,null,{"$f":"Logik!AE1","v":"C8"},"C8",false,"","F1","G2",false,"","F1E2","","","C8",0,{"$f":"IF(P28<>\"\",OFFSET(Logik!$D$4,0,ROW()-1),0)","v":0}]
[null,null,null,null,null,{"$f":"Logik!AF1","v":"D8"},"D8",false,"","F1","G2",false,"","F1E2","","","D8",0,{"$f":"IF(P29<>\"\",OFFSET(Logik!$D$4,0,ROW()-1),0)","v":0}]
[null,null,null,null,null,{"$f":"Logik!AG1","v":"E8"},"E8",false,"","F1","G2",false,"","F1E2","","","E8",0,{"$f":"IF(P30<>\"\",OFFSET(Logik!$D$4,0,ROW()-1),0)","v":0}]
[null,null,null,null,null,{"$f":"Logik!AH1","v":"F8"},"F8",false,"","F1","G2",false,"","F1E2","","","F8",0,{"$f":"IF(P31<>\"\",OFFSET(Logik!$D$4,0,ROW()-1),0)","v":0}]
[null,null,null,null,null,{"$f":"Logik!AI1","v":"G8"},"G8",false,"","F1","G2",false,"","F1E2","","","G8",0,{"$f":"IF(P32<>\"\",OFFSET(Logik!$D$4,0,ROW()-1),0)","v":0}]
[null,null,null,null,null,{"$f":"Logik!AJ1","v":"H8"},"H8",false,"","F1","G2",false,"","F1E2","","","H8",0,{"$f":"IF(P33<>\"\",OFFSET(Logik!$D$4,0,ROW()-1),0)","v":0}]

{"sheet":"P_G1","index":19,"n_rows":33,"n_cols":20,"rows_kept":33,"cut":false,"hidden":true,"merged":[]}
[null,null,null,null,null,{"$f":"Logik!D1","v":"Pos:"},"Pjäs:","RäckviddX","Pos",{"$f":"SUBSTITUTE(E2,B3,\"\")","v":"F3H3E2"},{"$f":"LEFT($E$2,$E$4-1)","v":""},null,null,null,null,"Nåbar","Vad","Poäng","PosPoäng","MöjligaDrag"]
["Pjäs:",{"$f":"Logik!K2","v":"G1"},null,"RäckviddX",{"$f":"IFERROR(INDEX(tblRVS,MATCH(\"VS\"&$B$3,RVS!$A$2:$A$120,0),5),\"\")","v":"G1F3H3E2"},{"$f":"UPPER(Logik!E1)","v":"A1"},{"$f":"UPPER(F2)","v":"A1"},{"$f":"IF($G2<>\"\",IF($G2<>$B$3,IF(IFERROR(FIND($G2,$E$2)>0,FALSE),TRUE,FALSE),FALSE),FALSE)","v":false},{"$f":"IF(H2,FIND($G2,$E$2),\"\")","v":""},{"$f":"J1","v":"F3H3E2"},{"$f":"IF(AND($G2<>\"\",$G2>0,$I2<$E$4),RIGHT(K1,MIN($E$4-$I2,LEN(K1))),K1)","v":""},null,null,null,null,{"$f":"IFERROR(IF(AND(G2<>\"\",$G2<>$B$3),FIND(G2,$E$6),\"\"),\"\")","v":""},"A1",{"$f":"IF(P2<>\"\",HLOOKUP(HLOOKUP(Q2,PjasStart,2,FALSE),Pjaser,4,FALSE),0)","v":0},{"$f":"IF(P2<>\"\",OFFSET(Logik!$D$4,0,ROW()-1),0)","v":0},{"$f":"SUBSTITUTE(E6,G2,\"\")","v":"F3H3E2"}]
["Pos:",{"$f":"UPPER(Logik!K1)","v":"G1"},null,null,null,{"$f":"Logik!F1","v":"B1"},{"$f":"UPPER(F3)","v":"B1"},{"$f":"IF($G3<>\"\",IF($G3<>$B$3,IF(IFERROR(FIND($G3,$E$2)>0,FALSE),TRUE,FALSE),FALSE),FALSE)","v":false},{"$f":"IF(H3,FIND($G3,$E$2),\"\")","v":""},{"$f":"J2","v":"F3H3E2"},{"$f":"IF(AND($G3<>\"\",$G3>0,$I3<$E$4),RIGHT(K2,MIN($E$4-$I3,LEN(K2))),K2)","v":""},null,null,null,null,{"$f":"IFERROR(IF(AND(G3<>\"\",$G3<>$B$3),FIND(G3,$E$6),\"\"),\"\")","v":""},"B1",0,{"$f":"IF(P3<>\"\",OFFSET(Logik!$D$4,0,ROW()-1),0)","v":0},{"$f":"SUBSTITUTE(T2,G3,\"\")","v":"F3H3E2"}]
["PosX:",{"$f":"LEFT(B3,1)","v":"G"},null,"PosX",{"$f":"FIND(B3,E2)","v":1},{"$f":"Logik!G1","v":"C1"},"C1",false,"","F3H3E2","",null,null,null,null,"","C1",0,{"$f":"IF(P4<>\"\",OFFSET(Logik!$D$4,0,ROW()-1),0)","v":0},{"$f":"SUBSTITUTE(T3,G4,\"\")","v":"F3H3E2"}]
["PosY:",{"$f":"RIGHT(B3,1)","v":"1"},null,null,null,{"$f":"Logik!H1","v":"D1"},"D1",false,"","F3H3E2","",null,null,null,null,"","D1",0,{"$f":"IF(P5<>\"\",OFFSET(Logik!$D$4,0,ROW()-1),0)","v":0},"F3H3E2"]
[null,null,null,"RX",{"$f":"K33&J33","v":"F3H3E2"},{"$f":"Logik!I1","v":"E1"},"E1",false,"","F3H3E2","",null,null,null,null,"","E1",0,{"$f":"IF(P6<>\"\",OFFSET(Logik!$D$4,0,ROW()-1),0)","v":0},"F3H3E2"]
["Poäng",{"$f":"Logik!K3","v":300},null,null,null,{"$f":"Logik!J1","v":"F1"},"F1",false,"","F3H3E2","",null,null,null,null,"","F1",0,{"$f":"IF(P7<>\"\",OFFSET(Logik!$D$4,0,ROW()-1),0)","v":0},"F3H3E2"]
["PosPoäng",{"$f":"Logik!K4","v":8},null,null,null,{"$f":"Logik!K1","v":"G1"},"G1",false,"","F3H3E2","",null,null,null,null,"","G1",0,{"$f":"IF(P8<>\"\",OFFSET(Logik!$D$4,0,ROW()-1),0)","v":0},"F3H3E2"]
[null,null,null,"Försvar",{"$f":"SUM(R2:R17)+SUM(S2:S17)","v":100},{"$f":"Logik!L1","v":"H1"},"H1",false,"","F3H3E2","",null,null,null,null,"","H1",0,{"$f":"IF(P9<>\"\",OFFSET(Logik!$D$4,0,ROW()-1),0)","v":0},"F3H3E2"]
[null,null,null,"Attack",{"$f":"SUM(R18:R33)+SUM(S18:S33)","v":0},{"$f":"Logik!M1","v":"A2"},"A2",false,"","F3H3E2","",null,null,null,null,"","A2",0,{"$f":"IF(P10<>\"\",OFFSET(Logik!$D$4,0,ROW()-1),0)","v":0},"F3H3E2"]
[null,null,null,"R Antal",{"$f":"LEN(E6)/2","v":3},{"$f":"Logik!N1","v":"B2"},"B2",false,"","F3H3E2","",null,null,null,null,"","B2",0,{"$f":"IF(P11<>\"\",OFFSET(Logik!$D$4,0,ROW()-1),0)","v":0},"F3H3E2"]
[null,null,null,null,null,{"$f":"Logik!O1","v":"C2"},"C2",false,"","F3H3E2","",null,null,null,null,"","C2",0,{"$f":"IF(P12<>\"\",OFFSET(Logik!$D$4,0,ROW()-1),0)","v":0},"F3H3E2"]
[null,null,null,"MöjligaDrag",{"$f":"T17","v":"F3H3"},{"$f":"Logik!P1","v":"D2"},"D2",false,"","F3H3E2","",null,null,null,null,"","D2",0,{"$f":"IF(P13<>\"\",OFFSET(Logik!$D$4,0,ROW()-1),0)","v":0},"F3H3E2"]
[null,null,null,"D Antal",{"$f":"LEN(E13)/2","v":2},{"$f":"Logik!Q1","v":"E2"},"E2",true,7,"F3H3E2","",null,null,null,null,5,"E2",100,{"$f":"IF(P14<>\"\",OFFSET(Logik!$D$4,0,ROW()-1),0)","v":0},"F3H3"]
[null,null,null,null,null,{"$f":"Logik!R1","v":"F2"},"F2",false,"","F3H3E2","",null,null,null,null,"","F2",0,{"$f":"IF(P15<>\"\",OFFSET(Logik!$D$4,0,ROW()-1),0)","v":0},"F3H3"]
[null,null,null,null,null,{"$f":"Logik!S1","v":"G2"},"G2",false,"","F3H3E2","",null,null,null,null,"","G2",0,{"$f":"IF(P16<>\"\",OFFSET(Logik!$D$4,0,ROW()-1),0)","v":0},"F3H3"]
[null,null,null,null,null,{"$f":"Logik!T1","v":"H2"},"H2",false,"","F3H3E2","",null,null,null,null,"","H2",0,{"$f":"IF(P17<>\"\",OFFSET(Logik!$D$4,0,ROW()-1),0)","v":0},"F3H3"]
[null,null,null,null,null,{"$f":"Logik!U1","v":"A7"},"A7",false,"","F3H3E2","",null,null,null,null,"","A7",{"$f":"IF(P18<>\"\",HLOOKUP(HLOOKUP(Q18,PjasStart,2,FALSE),Pjaser,3,FALSE),0)","v":0},{"$f":"IF(P18<>\"\",OFFSET(Logik!$D$4,0,ROW()-1),0)","v":0}]
[null,null,null,null,null,{"$f":"Logik!V1","v":"B7"},"B7",false,"","F3H3E2","",null,null,null,null,"","B7",0,{"$f":"IF(P19<>\"\",OFFSET(Logik!$D$4,0,ROW()-1),0)","v":0}]
[null,null,null,null,null,{"$f":"Logik!W1","v":"C7"},"C7",false,"","F3H3E2","",null,null,null,null,"","C7",0,{"$f":"IF(P20<>\"\",OFFSET(Logik!$D$4,0,ROW()-1),0)","v":0}]
[null,null,null,null,null,{"$f":"Logik!X1","v":"D7"},"D7",false,"","F3H3E2","",null,null,null,null,"","D7",0,{"$f":"IF(P21<>\"\",OFFSET(Logik!$D$4,0,ROW()-1),0)","v":0}]
[null,null,null,null,null,{"$f":"Logik!Y1","v":"E7"},"E7",false,"","F3H3E2","",null,null,null,null,"","E7",0,{"$f":"IF(P22<>\"\",OFFSET(Logik!$D$4,0,ROW()-1),0)","v":0}]
[null,null,null,null,null,{"$f":"Logik!Z1","v":"F7"},"F7",false,"","F3H3E2","",null,null,null,null,"","F7",0,{"$f":"IF(P23<>\"\",OFFSET(Logik!$D$4,0,ROW()-1),0)","v":0}]
[null,null,null,null,null,{"$f":"Logik!AA1","v":"G7"},"G7",false,"","F3H3E2","",null,null,null,null,"","G7",0,{"$f":"IF(P24<>\"\",OFFSET(Logik!$D$4,0,ROW()-1),0)","v":0}]
[null,null,null,null,null,{"$f":"Logik!AB1","v":"H7"},"H7",false,"","F3H3E2","",null,null,null,null,"","H7",0,{"$f":"IF(P25<>\"\",OFFSET(Logik!$D$4,0,ROW()-1),0)","v":0}]
[null,null,null,null,null,{"$f":"Logik!AC1","v":"A8"},"A8",false,"","F3H3E2","",null,null,null,null,"","A8",0,{"$f":"IF(P26<>\"\",OFFSET(Logik!$D$4,0,ROW()-1),0)","v":0}]
[null,null,null,null,null,{"$f":"Logik!AD1","v":"B8"},"B8",false,"","F3H3E2","",null,null,null,null,"","B8",0,{"$f":"IF(P27<>\"\",OFFSET(Logik!$D$4,0,ROW()-1),0)","v":0}]
[null,null,null,null,null,{"$f":"Logik!AE1","v":"C8"},"C8",false,"","F3H3E2","",null,null,null,null,"","C8",0,{"$f":"IF(P28<>\"\",OFFSET(Logik!$D$4,0,ROW()-1),0)","v":0}]
[null,null,null,null,null,{"$f":"Logik!AF1","v":"D8"},"D8",false,"","F3H3E2","",null,null,null,null,"","D8",0,{"$f":"IF(P29<>\"\",OFFSET(Logik!$D$4,0,ROW()-1),0)","v":0}]
[null,null,null,null,null,{"$f":"Logik!AG1","v":"E8"},"E8",false,"","F3H3E2","",null,null,null,null,"","E8",0,{"$f":"IF(P30<>\"\",OFFSET(Logik!$D$4,0,ROW()-1),0)","v":0}]
[null,null,null,null,null,{"$f":"Logik!AH1","v":"F8"},"F8",false,"","F3H3E2","",null,null,null,null,"","F8",0,{"$f":"IF(P31<>\"\",OFFSET(Logik!$D$4,0,ROW()-1),0)","v":0}]
[null,null,null,null,null,{"$f":"Logik!AI1","v":"G8"},"G8",false,"","F3H3E2","",null,null,null,null,"","G8",0,{"$f":"IF(P32<>\"\",OFFSET(Logik!$D$4,0,ROW()-1),0)","v":0}]
[null,null,null,null,null,{"$f":"Logik!AJ1","v":"H8"},"H8",false,"","F3H3E2","",null,null,null,null,"","H8",0,{"$f":"IF(P33<>\"\",OFFSET(Logik!$D$4,0,ROW()-1),0)","v":0}]

{"sheet":"P_H1","index":20,"n_rows":33,"n_cols":20,"rows_kept":33,"cut":false,"hidden":true,"merged":[]}
[null,null,null,null,null,{"$f":"Logik!D1","v":"Pos:"},"Pjäs:","RäckviddX","Pos",{"$f":"RIGHT($E$2,LEN($E$2)-$E$4+1)","v":"H1"},{"$f":"LEFT($E$2,$E$4-1)","v":"A1B1C1D1E1F1G1"},"RäckviddY",null,{"$f":"RIGHT($E$3,LEN($E$3)-$E$5+1)","v":"H1H2H3H4H5H6H7H8"},{"$f":"LEFT($E$3,$E$5-1)","v":""},"Nåbar","Vad","Poäng","PosPoäng","MöjligaDrag"]
["Pjäs:",{"$f":"Logik!L2","v":"H1"},null,"RäckviddX",{"$f":"IF($B$3<>\"\",\"A\"&B5&\"B\"&B5&\"C\"&B5&\"D\"&B5&\"E\"&B5&\"F\"&B5&\"G\"&B5&\"H\"&B5,\"\")","v":"A1B1C1D1E1F1G1H1"},{"$f":"UPPER(Logik!E1)","v":"A1"},{"$f":"UPPER(F2)","v":"A1"},{"$f":"IF($G2<>\"\",IF($G2<>$B$3,IF(IFERROR(FIND($G2,$E$2)>0,FALSE),TRUE,FALSE),FALSE),FALSE)","v":true},{"$f":"IF(H2,FIND($G2,$E$2),\"\")","v":1},{"$f":"IF(AND(I2<>\"\",I2>0,I2>$E$4),LEFT(J1,MIN(I2-$E$4+2,LEN(J1))),J1)","v":"H1"},{"$f":"IF(AND($G2<>\"\",$G2>0,$I2<$E$4),RIGHT(K1,MIN($E$4-$I2,LEN(K1))),K1)","v":"A1B1C1D1E1F1G1"},{"$f":"IF($G2<>\"\",IF($G2<>$B$3,IF(IFERROR(FIND($G2,$E$3)>0,FALSE),TRUE,FALSE),FALSE),FALSE)","v":false},{"$f":"IF(L2,FIND($G2,$E$3),\"\")","v":""},{"$f":"IF(AND(M2<>\"\",M2>0,M2>$E$5),LEFT(N1,MIN(M2-$E$5+2,LEN(N1))),N1)","v":"H1H2H3H4H5H6H7H8"},{"$f":"IF(AND($G2<>\"\",$G2>0,M2<$E$5),RIGHT(O1,MIN($E$5-M2,LEN(O1))),O1)","v":""},{"$f":"IFERROR(IF(AND(G2<>\"\",$G2<>$B$3),FIND(G2,$E$8),\"\"),\"\")","v":""},"A1",{"$f":"IF(P2<>\"\",HLOOKUP(HLOOKUP(Q2,PjasStart,2,FALSE),Pjaser,4,FALSE),0)","v":0},{"$f":"IF(P2<>\"\",OFFSET(Logik!$D$4,0,ROW()-1),0)","v":0},{"$f":"SUBSTITUTE(E8,G2,\"\")","v":"G1H1H1H2"}]
["Pos:",{"$f":"UPPER(Logik!L1)","v":"H1"},null,"RäckviddY",{"$f":"IF($B$3<>\"\",B4&\"1\"&B4&\"2\"&B4&\"3\"&B4&\"4\"&B4&\"5\"&B4&\"6\"&B4&\"7\"&B4&\"8\",\"\")","v":"H1H2H3H4H5H6H7H8"},{"$f":"Logik!F1","v":"B1"},{"$f":"UPPER(F3)","v":"B1"},{"$f":"IF($G3<>\"\",IF($G3<>$B$3,IF(IFERROR(FIND($G3,$E$2)>0,FALSE),TRUE,FALSE),FALSE),FALSE)","v":true},{"$f":"IF(H3,FIND($G3,$E$2),\"\")","v":3},{"$f":"IF(AND(I3<>\"\",I3>0,I3>$E$4),LEFT(J2,MIN(I3-$E$4+2,LEN(J2))),J2)","v":"H1"},{"$f":"IF(AND($G3<>\"\",$G3>0,$I3<$E$4),RIGHT(K2,MIN($E$4-$I3,LEN(K2))),K2)","v":"B1C1D1E1F1G1"},{"$f":"IF($G3<>\"\",IF($G3<>$B$3,IF(IFERROR(FIND($G3,$E$3)>0,FALSE),TRUE,FALSE),FALSE),FALSE)","v":false},{"$f":"IF(L3,FIND($G3,$E$3),\"\")","v":""},{"$f":"IF(AND(M3<>\"\",M3>0,M3>$E$5),LEFT(N2,MIN(M3-$E$5+2,LEN(N2))),N2)","v":"H1H2H3H4H5H6H7H8"},{"$f":"IF(AND($G3<>\"\",$G3>0,M3<$E$5),RIGHT(O2,MIN($E$5-M3,LEN(O2))),O2)","v":""},{"$f":"IFERROR(IF(AND(G3<>\"\",$G3<>$B$3),FIND(G3,$E$8),\"\"),\"\")","v":""},"B1",0,{"$f":"IF(P3<>\"\",OFFSET(Logik!$D$4,0,ROW()-1),0)","v":0},{"$f":"SUBSTITUTE(T2,G3,\"\")","v":"G1H1H1H2"}]
["PosX:",{"$f":"LEFT(B3,1)","v":"H"},null,"PosX",{"$f":"FIND(B3,E2)","v":15},{"$f":"Logik!G1","v":"C1"},"C1",true,5,"H1","C1D1E1F1G1",false,"","H1H2H3H4H5H6H7H8","","","C1",0,{"$f":"IF(P4<>\"\",OFFSET(Logik!$D$4,0,ROW()-1),0)","v":0},{"$f":"SUBSTITUTE(T3,G4,\"\")","v":"G1H1H1H2"}]
["PosY:",{"$f":"RIGHT(B3,1)","v":"1"},null,"PosY",{"$f":"FIND(B3,E3)","v":1},{"$f":"Logik!H1","v":"D1"},"D1",true,7,"H1","D1E1F1G1",false,"","H1H2H3H4H5H6H7H8","","","D1",0,{"$f":"IF(P5<>\"\",OFFSET(Logik!$D$4,0,ROW()-1),0)","v":0},"G1H1H1H2"]
[null,null,null,"RX",{"$f":"K33&J33","v":"G1H1"},{"$f":"Logik!I1","v":"E1"},"E1",true,9,"H1","E1F1G1",false,"","H1H2H3H4H5H6H7H8","","","E1",0,{"$f":"IF(P6<>\"\",OFFSET(Logik!$D$4,0,ROW()-1),0)","v":0},"G1H1H1H2"]
["Poäng",{"$f":"Logik!L3","v":500},null,"RY",{"$f":"O33&N33","v":"H1H2"},{"$f":"Logik!J1","v":"F1"},"F1",true,11,"H1","F1G1",false,"","H1H2H3H4H5H6H7H8","","","F1",0,{"$f":"IF(P7<>\"\",OFFSET(Logik!$D$4,0,ROW()-1),0)","v":0},"G1H1H1H2"]
["PosPoäng",{"$f":"Logik!L4","v":6},null,"RXY",{"$f":"E6&E7","v":"G1H1H1H2"},{"$f":"Logik!K1","v":"G1"},"G1",true,13,"H1","G1",false,"","H1H2H3H4H5H6H7H8","",1,"G1",300,{"$f":"IF(P8<>\"\",OFFSET(Logik!$D$4,0,ROW()-1),0)","v":8},"H1H1H2"]
[null,null,null,"Försvar",{"$f":"SUM(R2:R17)+SUM(S2:S17)","v":408},{"$f":"Logik!L1","v":"H1"},"H1",false,"","H1","G1",false,"","H1H2H3H4H5H6H7H8","","","H1",0,{"$f":"IF(P9<>\"\",OFFSET(Logik!$D$4,0,ROW()-1),0)","v":0},"H2"]
[null,null,null,"Attack",{"$f":"SUM(R18:R33)+SUM(S18:S33)","v":0},{"$f":"Logik!M1","v":"A2"},"A2",false,"","H1","G1",false,"","H1H2H3H4H5H6H7H8","","","A2",0,{"$f":"IF(P10<>\"\",OFFSET(Logik!$D$4,0,ROW()-1),0)","v":0},"H2"]
[null,null,null,"R Antal",{"$f":"LEN(E8)/2","v":4},{"$f":"Logik!N1","v":"B2"},"B2",false,"","H1","G1",false,"","H1H2H3H4H5H6H7H8","","","B2",0,{"$f":"IF(P11<>\"\",OFFSET(Logik!$D$4,0,ROW()-1),0)","v":0},"H2"]
[null,null,null,null,null,{"$f":"Logik!O1","v":"C2"},"C2",false,"","H1","G1",false,"","H1H2H3H4H5H6H7H8","","","C2",0,{"$f":"IF(P12<>\"\",OFFSET(Logik!$D$4,0,ROW()-1),0)","v":0},"H2"]
[null,null,null,"MöjligaDrag",{"$f":"T17","v":""},{"$f":"Logik!P1","v":"D2"},"D2",false,"","H1","G1",false,"","H1H2H3H4H5H6H7H8","","","D2",0,{"$f":"IF(P13<>\"\",OFFSET(Logik!$D$4,0,ROW()-1),0)","v":0},"H2"]
[null,null,null,"D Antal",{"$f":"LEN(E13)/2","v":0},{"$f":"Logik!Q1","v":"E2"},"E2",false,"","H1","G1",false,"","H1H2H3H4H5H6H7H8","","","E2",0,{"$f":"IF(P14<>\"\",OFFSET(Logik!$D$4,0,ROW()-1),0)","v":0},"H2"]
[null,null,null,null,null,{"$f":"Logik!R1","v":"F2"},"F2",false,"","H1","G1",false,"","H1H2H3H4H5H6H7H8","","","F2",0,{"$f":"IF(P15<>\"\",OFFSET(Logik!$D$4,0,ROW()-1),0)","v":0},"H2"]
[null,null,null,null,null,{"$f":"Logik!S1","v":"G2"},"G2",false,"","H1","G1",false,"","H1H2H3H4H5H6H7H8","","","G2",0,{"$f":"IF(P16<>\"\",OFFSET(Logik!$D$4,0,ROW()-1),0)","v":0},"H2"]
[null,null,null,null,null,{"$f":"Logik!T1","v":"H2"},"H2",false,"","H1","G1",true,3,"H1H2","",7,"H2",100,{"$f":"IF(P17<>\"\",OFFSET(Logik!$D$4,0,ROW()-1),0)","v":0},""]
[null,null,null,null,null,{"$f":"Logik!U1","v":"A7"},"A7",false,"","H1","G1",false,"","H1H2","","","A7",{"$f":"IF(P18<>\"\",HLOOKUP(HLOOKUP(Q18,PjasStart,2,FALSE),Pjaser,3,FALSE),0)","v":0},{"$f":"IF(P18<>\"\",OFFSET(Logik!$D$4,0,ROW()-1),0)","v":0}]
[null,null,null,null,null,{"$f":"Logik!V1","v":"B7"},"B7",false,"","H1","G1",false,"","H1H2","","","B7",0,{"$f":"IF(P19<>\"\",OFFSET(Logik!$D$4,0,ROW()-1),0)","v":0}]
[null,null,null,null,null,{"$f":"Logik!W1","v":"C7"},"C7",false,"","H1","G1",false,"","H1H2","","","C7",0,{"$f":"IF(P20<>\"\",OFFSET(Logik!$D$4,0,ROW()-1),0)","v":0}]
[null,null,null,null,null,{"$f":"Logik!X1","v":"D7"},"D7",false,"","H1","G1",false,"","H1H2","","","D7",0,{"$f":"IF(P21<>\"\",OFFSET(Logik!$D$4,0,ROW()-1),0)","v":0}]
[null,null,null,null,null,{"$f":"Logik!Y1","v":"E7"},"E7",false,"","H1","G1",false,"","H1H2","","","E7",0,{"$f":"IF(P22<>\"\",OFFSET(Logik!$D$4,0,ROW()-1),0)","v":0}]
[null,null,null,null,null,{"$f":"Logik!Z1","v":"F7"},"F7",false,"","H1","G1",false,"","H1H2","","","F7",0,{"$f":"IF(P23<>\"\",OFFSET(Logik!$D$4,0,ROW()-1),0)","v":0}]
[null,null,null,null,null,{"$f":"Logik!AA1","v":"G7"},"G7",false,"","H1","G1",false,"","H1H2","","","G7",0,{"$f":"IF(P24<>\"\",OFFSET(Logik!$D$4,0,ROW()-1),0)","v":0}]
[null,null,null,null,null,{"$f":"Logik!AB1","v":"H7"},"H7",false,"","H1","G1",true,13,"H1H2","","","H7",0,{"$f":"IF(P25<>\"\",OFFSET(Logik!$D$4,0,ROW()-1),0)","v":0}]
[null,null,null,null,null,{"$f":"Logik!AC1","v":"A8"},"A8",false,"","H1","G1",false,"","H1H2","","","A8",0,{"$f":"IF(P26<>\"\",OFFSET(Logik!$D$4,0,ROW()-1),0)","v":0}]
[null,null,null,null,null,{"$f":"Logik!AD1","v":"B8"},"B8",false,"","H1","G1",false,"","H1H2","","","B8",0,{"$f":"IF(P27<>\"\",OFFSET(Logik!$D$4,0,ROW()-1),0)","v":0}]
[null,null,null,null,null,{"$f":"Logik!AE1","v":"C8"},"C8",false,"","H1","G1",false,"","H1H2","","","C8",0,{"$f":"IF(P28<>\"\",OFFSET(Logik!$D$4,0,ROW()-1),0)","v":0}]
[null,null,null,null,null,{"$f":"Logik!AF1","v":"D8"},"D8",false,"","H1","G1",false,"","H1H2","","","D8",0,{"$f":"IF(P29<>\"\",OFFSET(Logik!$D$4,0,ROW()-1),0)","v":0}]
[null,null,null,null,null,{"$f":"Logik!AG1","v":"E8"},"E8",false,"","H1","G1",false,"","H1H2","","","E8",0,{"$f":"IF(P30<>\"\",OFFSET(Logik!$D$4,0,ROW()-1),0)","v":0}]
[null,null,null,null,null,{"$f":"Logik!AH1","v":"F8"},"F8",false,"","H1","G1",false,"","H1H2","","","F8",0,{"$f":"IF(P31<>\"\",OFFSET(Logik!$D$4,0,ROW()-1),0)","v":0}]
[null,null,null,null,null,{"$f":"Logik!AI1","v":"G8"},"G8",false,"","H1","G1",false,"","H1H2","","","G8",0,{"$f":"IF(P32<>\"\",OFFSET(Logik!$D$4,0,ROW()-1),0)","v":0}]
[null,null,null,null,null,{"$f":"Logik!AJ1","v":"H8"},"H8",false,"","H1","G1",true,15,"H1H2","","","H8",0,{"$f":"IF(P33<>\"\",OFFSET(Logik!$D$4,0,ROW()-1),0)","v":0}]

{"sheet":"P_A8","index":21,"n_rows":33,"n_cols":20,"rows_kept":33,"cut":false,"hidden":true,"merged":[]}
[null,null,null,null,null,{"$f":"Logik!D1","v":"Pos:"},"Pjäs:","RäckviddX","Pos",{"$f":"RIGHT($E$2,LEN($E$2)-$E$4+1)","v":"A8B8C8D8E8F8G8H8"},{"$f":"LEFT($E$2,$E$4-1)","v":""},"RäckviddY",null,{"$f":"RIGHT($E$3,LEN($E$3)-$E$5+1)","v":"A8"},{"$f":"LEFT($E$3,$E$5-1)","v":"A1A2A3A4A5A6A7"},"Nåbar","Vad","Poäng","PosPoäng"]
["Pjäs:",{"$f":"Logik!AC2","v":"A8"},null,"RäckviddX",{"$f":"IF($B$3<>\"\",\"A\"&B5&\"B\"&B5&\"C\"&B5&\"D\"&B5&\"E\"&B5&\"F\"&B5&\"G\"&B5&\"H\"&B5,\"\")","v":"A8B8C8D8E8F8G8H8"},{"$f":"UPPER(Logik!E1)","v":"A1"},{"$f":"UPPER(F2)","v":"A1"},{"$f":"IF($G2<>\"\",IF($G2<>$B$3,IF(IFERROR(FIND($G2,$E$2)>0,FALSE),TRUE,FALSE),FALSE),FALSE)","v":false},{"$f":"IF(H2,FIND($G2,$E$2),\"\")","v":""},{"$f":"IF(AND(I2<>\"\",I2>0,I2>$E$4),LEFT(J1,MIN(I2-$E$4+2,LEN(J1))),J1)","v":"A8B8C8D8E8F8G8H8"},{"$f":"IF(AND($G2<>\"\",$G2>0,$I2<$E$4),RIGHT(K1,MIN($E$4-$I2,LEN(K1))),K1)","v":""},{"$f":"IF($G2<>\"\",IF($G2<>$B$3,IF(IFERROR(FIND($G2,$E$3)>0,FALSE),TRUE,FALSE),FALSE),FALSE)","v":true},{"$f":"IF(L2,FIND($G2,$E$3),\"\")","v":1},{"$f":"IF(AND(M2<>\"\",M2>0,M2>$E$5),LEFT(N1,MIN(M2-$E$5+2,LEN(N1))),N1)","v":"A8"},{"$f":"IF(AND($G2<>\"\",$G2>0,M2<$E$5),RIGHT(O1,MIN($E$5-M2,LEN(O1))),O1)","v":"A1A2A3A4A5A6A7"},{"$f":"IFERROR(IF(AND(G2<>\"\",$G2<>$B$3),FIND(G2,$E$8),\"\"),\"\")","v":""},"A1",{"$f":"IF(P2<>\"\",HLOOKUP(HLOOKUP(Q2,PjasStart,2,FALSE),Pjaser,3,FALSE),0)","v":0},{"$f":"IF(P2<>\"\",OFFSET(Logik!$D$4,0,ROW()-1),0)","v":0}]
["Pos:",{"$f":"UPPER(Logik!AC1)","v":"A8"},null,"RäckviddY",{"$f":"IF($B$3<>\"\",B4&\"1\"&B4&\"2\"&B4&\"3\"&B4&\"4\"&B4&\"5\"&B4&\"6\"&B4&\"7\"&B4&\"8\",\"\")","v":"A1A2A3A4A5A6A7A8"},{"$f":"Logik!F1","v":"B1"},{"$f":"UPPER(F3)","v":"B1"},{"$f":"IF($G3<>\"\",IF($G3<>$B$3,IF(IFERROR(FIND($G3,$E$2)>0,FALSE),TRUE,FALSE),FALSE),FALSE)","v":false},{"$f":"IF(H3,FIND($G3,$E$2),\"\")","v":""},{"$f":"IF(AND(I3<>\"\",I3>0,I3>$E$4),LEFT(J2,MIN(I3-$E$4+2,LEN(J2))),J2)","v":"A8B8C8D8E8F8G8H8"},{"$f":"IF(AND($G3<>\"\",$G3>0,$I3<$E$4),RIGHT(K2,MIN($E$4-$I3,LEN(K2))),K2)","v":""},{"$f":"IF($G3<>\"\",IF($G3<>$B$3,IF(IFERROR(FIND($G3,$E$3)>0,FALSE),TRUE,FALSE),FALSE),FALSE)","v":false},{"$f":"IF(L3,FIND($G3,$E$3),\"\")","v":""},{"$f":"IF(AND(M3<>\"\",M3>0,M3>$E$5),LEFT(N2,MIN(M3-$E$5+2,LEN(N2))),N2)","v":"A8"},{"$f":"IF(AND($G3<>\"\",$G3>0,M3<$E$5),RIGHT(O2,MIN($E$5-M3,LEN(O2))),O2)","v":"A1A2A3A4A5A6A7"},{"$f":"IFERROR(IF(AND(G3<>\"\",$G3<>$B$3),FIND(G3,$E$8),\"\"),\"\")","v":""},"B1",0,{"$f":"IF(P3<>\"\",OFFSET(Logik!$D$4,0,ROW()-1),0)","v":0}]
["PosX:",{"$f":"LEFT(B3,1)","v":"A"},null,"PosX",{"$f":"FIND(B3,E2)","v":1},{"$f":"Logik!G1","v":"C1"},"C1",false,"","A8B8C8D8E8F8G8H8","",false,"","A8","A1A2A3A4A5A6A7","","C1",0,{"$f":"IF(P4<>\"\",OFFSET(Logik!$D$4,0,ROW()-1),0)","v":0}]
["PosY:",{"$f":"RIGHT(B3,1)","v":"8"},null,"PosY",{"$f":"FIND(B3,E3)","v":15},{"$f":"Logik!H1","v":"D1"},"D1",false,"","A8B8C8D8E8F8G8H8","",false,"","A8","A1A2A3A4A5A6A7","","D1",0,{"$f":"IF(P5<>\"\",OFFSET(Logik!$D$4,0,ROW()-1),0)","v":0}]
[null,null,null,"RX",{"$f":"K33&J33","v":"A8B8"},{"$f":"Logik!I1","v":"E1"},"E1",false,"","A8B8C8D8E8F8G8H8","",false,"","A8","A1A2A3A4A5A6A7","","E1",0,{"$f":"IF(P6<>\"\",OFFSET(Logik!$D$4,0,ROW()-1),0)","v":0}]
["Poäng",{"$f":"Logik!AC3","v":500},null,"RY",{"$f":"O33&N33","v":"A7A8"},{"$f":"Logik!J1","v":"F1"},"F1",false,"","A8B8C8D8E8F8G8H8","",false,"","A8","A1A2A3A4A5A6A7","","F1",0,{"$f":"IF(P7<>\"\",OFFSET(Logik!$D$4,0,ROW()-1),0)","v":0}]
["PosPoäng",{"$f":"Logik!AC4","v":6},null,"RXY",{"$f":"E6&E7","v":"A8B8A7A8"},{"$f":"Logik!K1","v":"G1"},"G1",false,"","A8B8C8D8E8F8G8H8","",false,"","A8","A1A2A3A4A5A6A7","","G1",0,{"$f":"IF(P8<>\"\",OFFSET(Logik!$D$4,0,ROW()-1),0)","v":0}]
[null,null,null,"Försvar",{"$f":"SUM(R18:R33)+SUM(S18:S33)","v":408},{"$f":"Logik!L1","v":"H1"},"H1",false,"","A8B8C8D8E8F8G8H8","",false,"","A8","A1A2A3A4A5A6A7","","H1",0,{"$f":"IF(P9<>\"\",OFFSET(Logik!$D$4,0,ROW()-1),0)","v":0}]
[null,null,null,"Attack",{"$f":"SUM(R2:R17)+SUM(S2:S17)","v":0},{"$f":"Logik!M1","v":"A2"},"A2",false,"","A8B8C8D8E8F8G8H8","",true,3,"A8","A2A3A4A5A6A7","","A2",0,{"$f":"IF(P10<>\"\",OFFSET(Logik!$D$4,0,ROW()-1),0)","v":0}]
[null,null,null,"R Antal",{"$f":"LEN(E8)/2","v":4},{"$f":"Logik!N1","v":"B2"},"B2",false,"","A8B8C8D8E8F8G8H8","",false,"","A8","A2A3A4A5A6A7","","B2",0,{"$f":"IF(P11<>\"\",OFFSET(Logik!$D$4,0,ROW()-1),0)","v":0}]
[null,null,null,null,null,{"$f":"Logik!O1","v":"C2"},"C2",false,"","A8B8C8D8E8F8G8H8","",false,"","A8","A2A3A4A5A6A7","","C2",0,{"$f":"IF(P12<>\"\",OFFSET(Logik!$D$4,0,ROW()-1),0)","v":0}]
[null,null,null,"MöjligaDrag",{"$f":"T33","v":""},{"$f":"Logik!P1","v":"D2"},"D2",false,"","A8B8C8D8E8F8G8H8","",false,"","A8","A2A3A4A5A6A7","","D2",0,{"$f":"IF(P13<>\"\",OFFSET(Logik!$D$4,0,ROW()-1),0)","v":0}]
[null,null,null,"D Antal",{"$f":"LEN(E13)/2","v":0},{"$f":"Logik!Q1","v":"E2"},"E2",false,"","A8B8C8D8E8F8G8H8","",false,"","A8","A2A3A4A5A6A7","","E2",0,{"$f":"IF(P14<>\"\",OFFSET(Logik!$D$4,0,ROW()-1),0)","v":0}]
[null,null,null,null,null,{"$f":"Logik!R1","v":"F2"},"F2",false,"","A8B8C8D8E8F8G8H8","",false,"","A8","A2A3A4A5A6A7","","F2",0,{"$f":"IF(P15<>\"\",OFFSET(Logik!$D$4,0,ROW()-1),0)","v":0}]
[null,null,null,null,null,{"$f":"Logik!S1","v":"G2"},"G2",false,"","A8B8C8D8E8F8G8H8","",false,"","A8","A2A3A4A5A6A7","","G2",0,{"$f":"IF(P16<>\"\",OFFSET(Logik!$D$4,0,ROW()-1),0)","v":0}]
[null,null,null,null,null,{"$f":"Logik!T1","v":"H2"},"H2",false,"","A8B8C8D8E8F8G8H8","",false,"","A8","A2A3A4A5A6A7","","H2",0,{"$f":"IF(P17<>\"\",OFFSET(Logik!$D$4,0,ROW()-1),0)","v":0},"MöjligaDrag"]
[null,null,null,null,null,{"$f":"Logik!U1","v":"A7"},"A7",false,"","A8B8C8D8E8F8G8H8","",true,13,"A8","A7",5,"A7",{"$f":"IF(P18<>\"\",HLOOKUP(HLOOKUP(Q18,PjasStart,2,FALSE),Pjaser,4,FALSE),0)","v":100},{"$f":"IF(P18<>\"\",OFFSET(Logik!$D$4,0,ROW()-1),0)","v":0},{"$f":"SUBSTITUTE(E8,G18,\"\")","v":"A8B8A8"}]
[null,null,null,null,null,{"$f":"Logik!V1","v":"B7"},"B7",false,"","A8B8C8D8E8F8G8H8","",false,"","A8","A7","","B7",0,{"$f":"IF(P19<>\"\",OFFSET(Logik!$D$4,0,ROW()-1),0)","v":0},{"$f":"SUBSTITUTE(T18,G19,\"\")","v":"A8B8A8"}]
[null,null,null,null,null,{"$f":"Logik!W1","v":"C7"},"C7",false,"","A8B8C8D8E8F8G8H8","",false,"","A8","A7","","C7",0,{"$f":"IF(P20<>\"\",OFFSET(Logik!$D$4,0,ROW()-1),0)","v":0},{"$f":"SUBSTITUTE(T19,G20,\"\")","v":"A8B8A8"}]
[null,null,null,null,null,{"$f":"Logik!X1","v":"D7"},"D7",false,"","A8B8C8D8E8F8G8H8","",false,"","A8","A7","","D7",0,{"$f":"IF(P21<>\"\",OFFSET(Logik!$D$4,0,ROW()-1),0)","v":0},"A8B8A8"]
[null,null,null,null,null,{"$f":"Logik!Y1","v":"E7"},"E7",false,"","A8B8C8D8E8F8G8H8","",false,"","A8","A7","","E7",0,{"$f":"IF(P22<>\"\",OFFSET(Logik!$D$4,0,ROW()-1),0)","v":0},"A8B8A8"]
[null,null,null,null,null,{"$f":"Logik!Z1","v":"F7"},"F7",false,"","A8B8C8D8E8F8G8H8","",false,"","A8","A7","","F7",0,{"$f":"IF(P23<>\"\",OFFSET(Logik!$D$4,0,ROW()-1),0)","v":0},"A8B8A8"]
[null,null,null,null,null,{"$f":"Logik!AA1","v":"G7"},"G7",false,"","A8B8C8D8E8F8G8H8","",false,"","A8","A7","","G7",0,{"$f":"IF(P24<>\"\",OFFSET(Logik!$D$4,0,ROW()-1),0)","v":0},"A8B8A8"]
[null,null,null,null,null,{"$f":"Logik!AB1","v":"H7"},"H7",false,"","A8B8C8D8E8F8G8H8","",false,"","A8","A7","","H7",0,{"$f":"IF(P25<>\"\",OFFSET(Logik!$D$4,0,ROW()-1),0)","v":0},"A8B8A8"]
[null,null,null,null,null,{"$f":"Logik!AC1","v":"A8"},"A8",false,"","A8B8C8D8E8F8G8H8","",false,"","A8","A7","","A8",0,{"$f":"IF(P26<>\"\",OFFSET(Logik!$D$4,0,ROW()-1),0)","v":0},"B8"]
[null,null,null,null,null,{"$f":"Logik!AD1","v":"B8"},"B8",true,3,"A8B8","",false,"","A8","A7",3,"B8",300,{"$f":"IF(P27<>\"\",OFFSET(Logik!$D$4,0,ROW()-1),0)","v":8},""]
[null,null,null,null,null,{"$f":"Logik!AE1","v":"C8"},"C8",true,5,"A8B8","",false,"","A8","A7","","C8",0,{"$f":"IF(P28<>\"\",OFFSET(Logik!$D$4,0,ROW()-1),0)","v":0},""]
[null,null,null,null,null,{"$f":"Logik!AF1","v":"D8"},"D8",true,7,"A8B8","",false,"","A8","A7","","D8",0,{"$f":"IF(P29<>\"\",OFFSET(Logik!$D$4,0,ROW()-1),0)","v":0},""]
[null,null,null,null,null,{"$f":"Logik!AG1","v":"E8"},"E8",true,9,"A8B8","",false,"","A8","A7","","E8",0,{"$f":"IF(P30<>\"\",OFFSET(Logik!$D$4,0,ROW()-1),0)","v":0},""]
[null,null,null,null,null,{"$f":"Logik!AH1","v":"F8"},"F8",true,11,"A8B8","",false,"","A8","A7","","F8",0,{"$f":"IF(P31<>\"\",OFFSET(Logik!$D$4,0,ROW()-1),0)","v":0},""]
[null,null,null,null,null,{"$f":"Logik!AI1","v":"G8"},"G8",true,13,"A8B8","",false,"","A8","A7","","G8",0,{"$f":"IF(P32<>\"\",OFFSET(Logik!$D$4,0,ROW()-1),0)","v":0},""]
[null,null,null,null,null,{"$f":"Logik!AJ1","v":"H8"},"H8",true,15,"A8B8","",false,"","A8","A7","","H8",0,{"$f":"IF(P33<>\"\",OFFSET(Logik!$D$4,0,ROW()-1),0)","v":0},""]

{"sheet":"P_B8","index":22,"n_rows":33,"n_cols":20,"rows_kept":33,"cut":false,"hidden":true,"merged":[]}
[null,null,null,null,null,{"$f":"Logik!D1","v":"Pos:"},"Pjäs:","RäckviddX","Pos",{"$f":"SUBSTITUTE(E2,B3,\"\")","v":"A6C6D7"},{"$f":"LEFT($E$2,$E$4-1)","v":""},null,null,null,null,"Nåbar","Vad","Poäng","PosPoäng"]
["Pjäs:",{"$f":"Logik!AD2","v":"B8"},null,"RäckviddX",{"$f":"IFERROR(INDEX(tblRVS,MATCH(\"VS\"&$B$3,RVS!$A$2:$A$120,0),5),\"\")","v":"B8A6C6D7"},{"$f":"UPPER(Logik!E1)","v":"A1"},{"$f":"UPPER(F2)","v":"A1"},{"$f":"IF($G2<>\"\",IF($G2<>$B$3,IF(IFERROR(FIND($G2,$E$2)>0,FALSE),TRUE,FALSE),FALSE),FALSE)","v":false},{"$f":"IF(H2,FIND($G2,$E$2),\"\")","v":""},{"$f":"J1","v":"A6C6D7"},{"$f":"IF(AND($G2<>\"\",$G2>0,$I2<$E$4),RIGHT(K1,MIN($E$4-$I2,LEN(K1))),K1)","v":""},null,null,null,null,{"$f":"IFERROR(IF(AND(G2<>\"\",$G2<>$B$3),FIND(G2,$E$6),\"\"),\"\")","v":""},"A1",{"$f":"IF(P2<>\"\",HLOOKUP(HLOOKUP(Q2,PjasStart,2,FALSE),Pjaser,3,FALSE),0)","v":0},{"$f":"IF(P2<>\"\",OFFSET(Logik!$D$4,0,ROW()-1),0)","v":0}]
["Pos:",{"$f":"UPPER(Logik!AD1)","v":"B8"},null,null,null,{"$f":"Logik!F1","v":"B1"},{"$f":"UPPER(F3)","v":"B1"},{"$f":"IF($G3<>\"\",IF($G3<>$B$3,IF(IFERROR(FIND($G3,$E$2)>0,FALSE),TRUE,FALSE),FALSE),FALSE)","v":false},{"$f":"IF(H3,FIND($G3,$E$2),\"\")","v":""},{"$f":"J2","v":"A6C6D7"},{"$f":"IF(AND($G3<>\"\",$G3>0,$I3<$E$4),RIGHT(K2,MIN($E$4-$I3,LEN(K2))),K2)","v":""},null,null,null,null,{"$f":"IFERROR(IF(AND(G3<>\"\",$G3<>$B$3),FIND(G3,$E$6),\"\"),\"\")","v":""},"B1",0,{"$f":"IF(P3<>\"\",OFFSET(Logik!$D$4,0,ROW()-1),0)","v":0}]
["PosX:",{"$f":"LEFT(B3,1)","v":"B"},null,"PosX",{"$f":"FIND(B3,E2)","v":1},{"$f":"Logik!G1","v":"C1"},"C1",false,"","A6C6D7","",null,null,null,null,"","C1",0,{"$f":"IF(P4<>\"\",OFFSET(Logik!$D$4,0,ROW()-1),0)","v":0}]
["PosY:",{"$f":"RIGHT(B3,1)","v":"8"},null,null,null,{"$f":"Logik!H1","v":"D1"},"D1",false,"","A6C6D7","",null,null,null,null,"","D1",0,{"$f":"IF(P5<>\"\",OFFSET(Logik!$D$4,0,ROW()-1),0)","v":0}]
[null,null,null,"RX",{"$f":"K33&J33","v":"A6C6D7"},{"$f":"Logik!I1","v":"E1"},"E1",false,"","A6C6D7","",null,null,null,null,"","E1",0,{"$f":"IF(P6<>\"\",OFFSET(Logik!$D$4,0,ROW()-1),0)","v":0}]
["Poäng",{"$f":"Logik!AD3","v":300},null,null,null,{"$f":"Logik!J1","v":"F1"},"F1",false,"","A6C6D7","",null,null,null,null,"","F1",0,{"$f":"IF(P7<>\"\",OFFSET(Logik!$D$4,0,ROW()-1),0)","v":0}]
["PosPoäng",{"$f":"Logik!AD4","v":8},null,null,null,{"$f":"Logik!K1","v":"G1"},"G1",false,"","A6C6D7","",null,null,null,null,"","G1",0,{"$f":"IF(P8<>\"\",OFFSET(Logik!$D$4,0,ROW()-1),0)","v":0}]
[null,null,null,"Försvar",{"$f":"SUM(R18:R33)+SUM(S18:S33)","v":100},{"$f":"Logik!L1","v":"H1"},"H1",false,"","A6C6D7","",null,null,null,null,"","H1",0,{"$f":"IF(P9<>\"\",OFFSET(Logik!$D$4,0,ROW()-1),0)","v":0}]
[null,null,null,"Attack",{"$f":"SUM(R2:R17)+SUM(S2:S17)","v":0},{"$f":"Logik!M1","v":"A2"},"A2",false,"","A6C6D7","",null,null,null,null,"","A2",0,{"$f":"IF(P10<>\"\",OFFSET(Logik!$D$4,0,ROW()-1),0)","v":0}]
[null,null,null,"R Antal",{"$f":"LEN(E6)/2","v":3},{"$f":"Logik!N1","v":"B2"},"B2",false,"","A6C6D7","",null,null,null,null,"","B2",0,{"$f":"IF(P11<>\"\",OFFSET(Logik!$D$4,0,ROW()-1),0)","v":0}]
[null,null,null,null,null,{"$f":"Logik!O1","v":"C2"},"C2",false,"","A6C6D7","",null,null,null,null,"","C2",0,{"$f":"IF(P12<>\"\",OFFSET(Logik!$D$4,0,ROW()-1),0)","v":0}]
[null,null,null,"MöjligaDrag",{"$f":"T33","v":"A6C6"},{"$f":"Logik!P1","v":"D2"},"D2",false,"","A6C6D7","",null,null,null,null,"","D2",0,{"$f":"IF(P13<>\"\",OFFSET(Logik!$D$4,0,ROW()-1),0)","v":0}]
[null,null,null,"D Antal",{"$f":"LEN(E13)/2","v":2},{"$f":"Logik!Q1","v":"E2"},"E2",false,"","A6C6D7","",null,null,null,null,"","E2",0,{"$f":"IF(P14<>\"\",OFFSET(Logik!$D$4,0,ROW()-1),0)","v":0}]
[null,null,null,null,null,{"$f":"Logik!R1","v":"F2"},"F2",false,"","A6C6D7","",null,null,null,null,"","F2",0,{"$f":"IF(P15<>\"\",OFFSET(Logik!$D$4,0,ROW()-1),0)","v":0}]
[null,null,null,null,null,{"$f":"Logik!S1","v":"G2"},"G2",false,"","A6C6D7","",null,null,null,null,"","G2",0,{"$f":"IF(P16<>\"\",OFFSET(Logik!$D$4,0,ROW()-1),0)","v":0}]
[null,null,null,null,null,{"$f":"Logik!T1","v":"H2"},"H2",false,"","A6C6D7","",null,null,null,null,"","H2",0,{"$f":"IF(P17<>\"\",OFFSET(Logik!$D$4,0,ROW()-1),0)","v":0},"MöjligaDrag"]
[null,null,null,null,null,{"$f":"Logik!U1","v":"A7"},"A7",false,"","A6C6D7","",null,null,null,null,"","A7",{"$f":"IF(P18<>\"\",HLOOKUP(HLOOKUP(Q18,PjasStart,2,FALSE),Pjaser,4,FALSE),0)","v":0},{"$f":"IF(P18<>\"\",OFFSET(Logik!$D$4,0,ROW()-1),0)","v":0},{"$f":"SUBSTITUTE(E6,G18,\"\")","v":"A6C6D7"}]
[null,null,null,null,null,{"$f":"Logik!V1","v":"B7"},"B7",false,"","A6C6D7","",null,null,null,null,"","B7",0,{"$f":"IF(P19<>\"\",OFFSET(Logik!$D$4,0,ROW()-1),0)","v":0},{"$f":"SUBSTITUTE(T18,G19,\"\")","v":"A6C6D7"}]
[null,null,null,null,null,{"$f":"Logik!W1","v":"C7"},"C7",false,"","A6C6D7","",null,null,null,null,"","C7",0,{"$f":"IF(P20<>\"\",OFFSET(Logik!$D$4,0,ROW()-1),0)","v":0},{"$f":"SUBSTITUTE(T19,G20,\"\")","v":"A6C6D7"}]
[null,null,null,null,null,{"$f":"Logik!X1","v":"D7"},"D7",true,7,"A6C6D7","",null,null,null,null,5,"D7",100,{"$f":"IF(P21<>\"\",OFFSET(Logik!$D$4,0,ROW()-1),0)","v":0},"A6C6"]
[null,null,null,null,null,{"$f":"Logik!Y1","v":"E7"},"E7",false,"","A6C6D7","",null,null,null,null,"","E7",0,{"$f":"IF(P22<>\"\",OFFSET(Logik!$D$4,0,ROW()-1),0)","v":0},"A6C6"]
[null,null,null,null,null,{"$f":"Logik!Z1","v":"F7"},"F7",false,"","A6C6D7","",null,null,null,null,"","F7",0,{"$f":"IF(P23<>\"\",OFFSET(Logik!$D$4,0,ROW()-1),0)","v":0},"A6C6"]
[null,null,null,null,null,{"$f":"Logik!AA1","v":"G7"},"G7",false,"","A6C6D7","",null,null,null,null,"","G7",0,{"$f":"IF(P24<>\"\",OFFSET(Logik!$D$4,0,ROW()-1),0)","v":0},"A6C6"]
[null,null,null,null,null,{"$f":"Logik!AB1","v":"H7"},"H7",false,"","A6C6D7","",null,null,null,null,"","H7",0,{"$f":"IF(P25<>\"\",OFFSET(Logik!$D$4,0,ROW()-1),0)","v":0},"A6C6"]
[null,null,null,null,null,{"$f":"Logik!AC1","v":"A8"},"A8",false,"","A6C6D7","",null,null,null,null,"","A8",0,{"$f":"IF(P26<>\"\",OFFSET(Logik!$D$4,0,ROW()-1),0)","v":0},"A6C6"]
[null,null,null,null,null,{"$f":"Logik!AD1","v":"B8"},"B8",false,"","A6C6D7","",null,null,null,null,"","B8",0,{"$f":"IF(P27<>\"\",OFFSET(Logik!$D$4,0,ROW()-1),0)","v":0},"A6C6"]
[null,null,null,null,null,{"$f":"Logik!AE1","v":"C8"},"C8",false,"","A6C6D7","",null,null,null,null,"","C8",0,{"$f":"IF(P28<>\"\",OFFSET(Logik!$D$4,0,ROW()-1),0)","v":0},"A6C6"]
[null,null,null,null,null,{"$f":"Logik!AF1","v":"D8"},"D8",false,"","A6C6D7","",null,null,null,null,"","D8",0,{"$f":"IF(P29<>\"\",OFFSET(Logik!$D$4,0,ROW()-1),0)","v":0},"A6C6"]
[null,null,null,null,null,{"$f":"Logik!AG1","v":"E8"},"E8",false,"","A6C6D7","",null,null,null,null,"","E8",0,{"$f":"IF(P30<>\"\",OFFSET(Logik!$D$4,0,ROW()-1),0)","v":0},"A6C6"]
[null,null,null,null,null,{"$f":"Logik!AH1","v":"F8"},"F8",false,"","A6C6D7","",null,null,null,null,"","F8",0,{"$f":"IF(P31<>\"\",OFFSET(Logik!$D$4,0,ROW()-1),0)","v":0},"A6C6"]
[null,null,null,null,null,{"$f":"Logik!AI1","v":"G8"},"G8",false,"","A6C6D7","",null,null,null,null,"","G8",0,{"$f":"IF(P32<>\"\",OFFSET(Logik!$D$4,0,ROW()-1),0)","v":0},"A6C6"]
[null,null,null,null,null,{"$f":"Logik!AJ1","v":"H8"},"H8",false,"","A6C6D7","",null,null,null,null,"","H8",0,{"$f":"IF(P33<>\"\",OFFSET(Logik!$D$4,0,ROW()-1),0)","v":0},"A6C6"]

{"sheet":"P_C8","index":23,"n_rows":33,"n_cols":20,"rows_kept":33,"cut":false,"hidden":true,"merged":[]}
[null,null,null,null,null,{"$f":"Logik!D1","v":"Pos:"},"Pjäs:","Fräckvidd","Pos",{"$f":"RIGHT($E$23,LEN($E$23)-$E$4+1)","v":"C8B7A6"},{"$f":"LEFT($E$23,$E$4-1)","v":""},"Fräckvidd","Pos",{"$f":"RIGHT($E$24,LEN($E$24)-$E$5+1)","v":"C8"},{"$f":"LEFT($E$24,$E$5-1)","v":"H3G4F5E6D7"},"Nåbar","Vad","Poäng","PosPoäng"]
["Pjäs:",{"$f":"Logik!AE2","v":"C8"},null,null,null,{"$f":"UPPER(Logik!E1)","v":"A1"},{"$f":"UPPER(F2)","v":"A1"},{"$f":"IF($G2<>\"\",IF($G2<>$B$3,IF(IFERROR(FIND($G2,$E$23)>0,FALSE),TRUE,FALSE),FALSE),FALSE)","v":false},{"$f":"IF(H2,FIND($G2,$E$23),\"\")","v":""},{"$f":"IFERROR(IF(AND($I2<>\"\",$I2>0,$I2>$E$4),LEFT(J1,MIN($I2-$E$4+2,LEN(J1))),J1),J1)","v":"C8B7A6"},{"$f":"IF(AND($I2<>\"\",$I2>0,$I2<$E$4),RIGHT(K1,MIN($E$4-$I2,LEN(K1))),K1)","v":""},{"$f":"IF($G2<>\"\",IF($G2<>$B$3,IF(IFERROR(FIND($G2,$E$24)>0,FALSE),TRUE,FALSE),FALSE),FALSE)","v":false},{"$f":"IF(L2,FIND($G2,$E$24),\"\")","v":""},{"$f":"IFERROR(IF(AND($M2<>\"\",$M2>0,$M2>$E$5),LEFT(N1,MIN($M2-$E$5+2,LEN(N1))),N1),N1)","v":"C8"},{"$f":"IF(AND($M2<>\"\",$M2>0,$M2<$E$5),RIGHT(O1,MIN($E$5-$M2,LEN(O1))),O1)","v":"H3G4F5E6D7"},{"$f":"IFERROR(IF(AND(G2<>\"\",$G2<>$B$3),FIND(G2,$E$8),\"\"),\"\")","v":""},"A1",{"$f":"IF(P2<>\"\",HLOOKUP(HLOOKUP(Q2,PjasStart,2,FALSE),Pjaser,3,FALSE),0)","v":0},{"$f":"IF(P2<>\"\",OFFSET(Logik!$D$4,0,ROW()-1),0)","v":0}]
["Pos:",{"$f":"UPPER(Logik!AE1)","v":"C8"},null,null,null,{"$f":"Logik!F1","v":"B1"},{"$f":"UPPER(F3)","v":"B1"},{"$f":"IF($G3<>\"\",IF($G3<>$B$3,IF(IFERROR(FIND($G3,$E$23)>0,FALSE),TRUE,FALSE),FALSE),FALSE)","v":false},{"$f":"IF(H3,FIND($G3,$E$23),\"\")","v":""},{"$f":"IFERROR(IF(AND($I3<>\"\",$I3>0,$I3>$E$4),LEFT(J2,MIN($I3-$E$4+2,LEN(J2))),J2),J2)","v":"C8B7A6"},{"$f":"IF(AND($I3<>\"\",$I3>0,$I3<$E$4),RIGHT(K2,MIN($E$4-$I3,LEN(K2))),K2)","v":""},{"$f":"IF($G3<>\"\",IF($G3<>$B$3,IF(IFERROR(FIND($G3,$E$24)>0,FALSE),TRUE,FALSE),FALSE),FALSE)","v":false},{"$f":"IF(L3,FIND($G3,$E$24),\"\")","v":""},{"$f":"IFERROR(IF(AND($M3<>\"\",$M3>0,$M3>$E$5),LEFT(N2,MIN($M3-$E$5+2,LEN(N2))),N2),N2)","v":"C8"},{"$f":"IF(AND($M3<>\"\",$M3>0,$M3<$E$5),RIGHT(O2,MIN($E$5-$M3,LEN(O2))),O2)","v":"H3G4F5E6D7"},{"$f":"IFERROR(IF(AND(G3<>\"\",$G3<>$B$3),FIND(G3,$E$8),\"\"),\"\")","v":""},"B1",0,{"$f":"IF(P3<>\"\",OFFSET(Logik!$D$4,0,ROW()-1),0)","v":0}]
["PosX:",{"$f":"LEFT(B3,1)","v":"C"},null,"PosX",{"$f":"FIND(B3,E23)","v":1},{"$f":"Logik!G1","v":"C1"},"C1",false,"","C8B7A6","",false,"","C8","H3G4F5E6D7","","C1",0,{"$f":"IF(P4<>\"\",OFFSET(Logik!$D$4,0,ROW()-1),0)","v":0}]
["PosY:",{"$f":"RIGHT(B3,1)","v":"8"},null,"PosY",{"$f":"IFERROR(FIND(B3,E24),0)","v":11},{"$f":"Logik!H1","v":"D1"},"D1",false,"","C8B7A6","",false,"","C8","H3G4F5E6D7","","D1",0,{"$f":"IF(P5<>\"\",OFFSET(Logik!$D$4,0,ROW()-1),0)","v":0}]
[null,null,null,"RA",{"$f":"K33&J33","v":"C8B7"},{"$f":"Logik!I1","v":"E1"},"E1",false,"","C8B7A6","",false,"","C8","H3G4F5E6D7","","E1",0,{"$f":"IF(P6<>\"\",OFFSET(Logik!$D$4,0,ROW()-1),0)","v":0}]
["Poäng",{"$f":"Logik!AE3","v":300},null,"RB",{"$f":"O33&N33","v":"D7C8"},{"$f":"Logik!J1","v":"F1"},"F1",false,"","C8B7A6","",false,"","C8","H3G4F5E6D7","","F1",0,{"$f":"IF(P7<>\"\",OFFSET(Logik!$D$4,0,ROW()-1),0)","v":0}]
["PosPoäng",{"$f":"Logik!AE4","v":10},null,"RAB",{"$f":"E6&E7","v":"C8B7D7C8"},{"$f":"Logik!K1","v":"G1"},"G1",false,"","C8B7A6","",false,"","C8","H3G4F5E6D7","","G1",0,{"$f":"IF(P8<>\"\",OFFSET(Logik!$D$4,0,ROW()-1),0)","v":0}]
[null,null,null,"Försvar",{"$f":"SUM(R18:R33)+SUM(S18:S33)","v":200},{"$f":"Logik!L1","v":"H1"},"H1",false,"","C8B7A6","",false,"","C8","H3G4F5E6D7","","H1",0,{"$f":"IF(P9<>\"\",OFFSET(Logik!$D$4,0,ROW()-1),0)","v":0}]
[null,null,null,"Attack",{"$f":"SUM(R2:R17)+SUM(S2:S17)","v":0},{"$f":"Logik!M1","v":"A2"},"A2",false,"","C8B7A6","",false,"","C8","H3G4F5E6D7","","A2",0,{"$f":"IF(P10<>\"\",OFFSET(Logik!$D$4,0,ROW()-1),0)","v":0}]
[null,null,null,"R Antal",{"$f":"LEN(E8)/2","v":4},{"$f":"Logik!N1","v":"B2"},"B2",false,"","C8B7A6","",false,"","C8","H3G4F5E6D7","","B2",0,{"$f":"IF(P11<>\"\",OFFSET(Logik!$D$4,0,ROW()-1),0)","v":0}]
[null,null,null,null,null,{"$f":"Logik!O1","v":"C2"},"C2",false,"","C8B7A6","",false,"","C8","H3G4F5E6D7","","C2",0,{"$f":"IF(P12<>\"\",OFFSET(Logik!$D$4,0,ROW()-1),0)","v":0}]
[null,null,null,"FRvA",{"$f":"IFERROR(INDEX(tblRVL,MATCH(\"VL\"&$B$3,RVL!$A$2:$A$129,0),5),\"\")","v":"C8B7A6"},{"$f":"Logik!P1","v":"D2"},"D2",false,"","C8B7A6","",false,"","C8","H3G4F5E6D7","","D2",0,{"$f":"IF(P13<>\"\",OFFSET(Logik!$D$4,0,ROW()-1),0)","v":0}]
[null,null,null,"FRvB",{"$f":"IFERROR(INDEX(tblRVL,MATCH(\"VL\"&$B$3,RVL!$A$2:$A$129,0),6),\"\")","v":"C8"},{"$f":"Logik!Q1","v":"E2"},"E2",false,"","C8B7A6","",false,"","C8","H3G4F5E6D7","","E2",0,{"$f":"IF(P14<>\"\",OFFSET(Logik!$D$4,0,ROW()-1),0)","v":0}]
[null,null,null,"FRvC",{"$f":"IFERROR(INDEX(tblRVL,MATCH(\"VL\"&$B$3,RVL!$A$2:$A$129,0),7),\"\")","v":"H3G4F5E6D7"},{"$f":"Logik!R1","v":"F2"},"F2",false,"","C8B7A6","",false,"","C8","H3G4F5E6D7","","F2",0,{"$f":"IF(P15<>\"\",OFFSET(Logik!$D$4,0,ROW()-1),0)","v":0}]
[null,null,null,"FRvD",{"$f":"IFERROR(INDEX(tblRVL,MATCH(\"VL\"&$B$3,RVL!$A$2:$A$129,0),8),\"\")","v":""},{"$f":"Logik!S1","v":"G2"},"G2",false,"","C8B7A6","",false,"","C8","H3G4F5E6D7","","G2",0,{"$f":"IF(P16<>\"\",OFFSET(Logik!$D$4,0,ROW()-1),0)","v":0}]
[null,null,null,null,null,{"$f":"Logik!T1","v":"H2"},"H2",false,"","C8B7A6","",false,"","C8","H3G4F5E6D7","","H2",0,{"$f":"IF(P17<>\"\",OFFSET(Logik!$D$4,0,ROW()-1),0)","v":0},"MöjligaDrag"]
[null,null,null,"ARvA",{"$f":"IFERROR(INDEX(tblRVL,MATCH(\"VL\"&$B$3,RVL!$A$2:$A$129,0),9),\"\")","v":"B7A6"},{"$f":"Logik!U1","v":"A7"},"A7",false,"","C8B7A6","",false,"","C8","H3G4F5E6D7","","A7",{"$f":"IF(P18<>\"\",HLOOKUP(HLOOKUP(Q18,PjasStart,2,FALSE),Pjaser,4,FALSE),0)","v":0},{"$f":"IF(P18<>\"\",OFFSET(Logik!$D$4,0,ROW()-1),0)","v":0},{"$f":"SUBSTITUTE(E8,G18,\"\")","v":"C8B7D7C8"}]
[null,null,null,"ARvB",{"$f":"IFERROR(INDEX(tblRVL,MATCH(\"VL\"&$B$3,RVL!$A$2:$A$129,0),10),\"\")","v":""},{"$f":"Logik!V1","v":"B7"},"B7",true,3,"C8B7","",false,"","C8","H3G4F5E6D7",3,"B7",100,{"$f":"IF(P19<>\"\",OFFSET(Logik!$D$4,0,ROW()-1),0)","v":0},{"$f":"SUBSTITUTE(T18,G19,\"\")","v":"C8D7C8"}]
[null,null,null,"ARvC",{"$f":"IFERROR(INDEX(tblRVL,MATCH(\"VL\"&$B$3,RVL!$A$2:$A$129,0),11),\"\")","v":"H3G4F5E6D7"},{"$f":"Logik!W1","v":"C7"},"C7",false,"","C8B7","",false,"","C8","H3G4F5E6D7","","C7",0,{"$f":"IF(P20<>\"\",OFFSET(Logik!$D$4,0,ROW()-1),0)","v":0},{"$f":"SUBSTITUTE(T19,G20,\"\")","v":"C8D7C8"}]
[null,null,null,"ARvD",{"$f":"IFERROR(INDEX(tblRVL,MATCH(\"VL\"&$B$3,RVL!$A$2:$A$129,0),12),\"\")","v":""},{"$f":"Logik!X1","v":"D7"},"D7",false,"","C8B7","",true,9,"C8","D7",5,"D7",100,{"$f":"IF(P21<>\"\",OFFSET(Logik!$D$4,0,ROW()-1),0)","v":0},"C8C8"]
[null,null,null,null,null,{"$f":"Logik!Y1","v":"E7"},"E7",false,"","C8B7","",false,"","C8","D7","","E7",0,{"$f":"IF(P22<>\"\",OFFSET(Logik!$D$4,0,ROW()-1),0)","v":0},"C8C8"]
[null,null,null,"FR1",{"$f":"E16&E13","v":"C8B7A6"},{"$f":"Logik!Z1","v":"F7"},"F7",false,"","C8B7","",false,"","C8","D7","","F7",0,{"$f":"IF(P23<>\"\",OFFSET(Logik!$D$4,0,ROW()-1),0)","v":0},"C8C8"]
[null,null,null,"FR2",{"$f":"E15&E14","v":"H3G4F5E6D7C8"},{"$f":"Logik!AA1","v":"G7"},"G7",false,"","C8B7","",false,"","C8","D7","","G7",0,{"$f":"IF(P24<>\"\",OFFSET(Logik!$D$4,0,ROW()-1),0)","v":0},"C8C8"]
[null,null,null,null,null,{"$f":"Logik!AB1","v":"H7"},"H7",false,"","C8B7","",false,"","C8","D7","","H7",0,{"$f":"IF(P25<>\"\",OFFSET(Logik!$D$4,0,ROW()-1),0)","v":0},"C8C8"]
[null,null,null,"MöjligaDrag",{"$f":"T33","v":""},{"$f":"Logik!AC1","v":"A8"},"A8",false,"","C8B7","",false,"","C8","D7","","A8",0,{"$f":"IF(P26<>\"\",OFFSET(Logik!$D$4,0,ROW()-1),0)","v":0},"C8C8"]
[null,null,null,"D Antal",{"$f":"LEN(E26)/2","v":0},{"$f":"Logik!AD1","v":"B8"},"B8",false,"","C8B7","",false,"","C8","D7","","B8",0,{"$f":"IF(P27<>\"\",OFFSET(Logik!$D$4,0,ROW()-1),0)","v":0},"C8C8"]
[null,null,null,null,null,{"$f":"Logik!AE1","v":"C8"},"C8",false,"","C8B7","",false,"","C8","D7","","C8",0,{"$f":"IF(P28<>\"\",OFFSET(Logik!$D$4,0,ROW()-1),0)","v":0},""]
[null,null,null,null,null,{"$f":"Logik!AF1","v":"D8"},"D8",false,"","C8B7","",false,"","C8","D7","","D8",0,{"$f":"IF(P29<>\"\",OFFSET(Logik!$D$4,0,ROW()-1),0)","v":0},""]
[null,null,null,null,null,{"$f":"Logik!AG1","v":"E8"},"E8",false,"","C8B7","",false,"","C8","D7","","E8",0,{"$f":"IF(P30<>\"\",OFFSET(Logik!$D$4,0,ROW()-1),0)","v":0},""]
[null,null,null,null,null,{"$f":"Logik!AH1","v":"F8"},"F8",false,"","C8B7","",false,"","C8","D7","","F8",0,{"$f":"IF(P31<>\"\",OFFSET(Logik!$D$4,0,ROW()-1),0)","v":0},""]
[null,null,null,null,null,{"$f":"Logik!AI1","v":"G8"},"G8",false,"","C8B7","",false,"","C8","D7","","G8",0,{"$f":"IF(P32<>\"\",OFFSET(Logik!$D$4,0,ROW()-1),0)","v":0},""]
[null,null,null,null,null,{"$f":"Logik!AJ1","v":"H8"},"H8",false,"","C8B7","",false,"","C8","D7","","H8",0,{"$f":"IF(P33<>\"\",OFFSET(Logik!$D$4,0,ROW()-1),0)","v":0},""]

{"sheet":"P_D8","index":24,"n_rows":33,"n_cols":28,"rows_kept":33,"cut":false,"hidden":true,"merged":[]}
[null,null,null,null,null,{"$f":"Logik!D1","v":"Pos:"},"Pjäs:","Diagonal1","Pos",{"$f":"RIGHT($E$21,LEN($E$21)-$E$2+1)","v":"D8C7B6A5"},{"$f":"LEFT($E$21,$E$2-1)","v":""},"Diagonal2","Pos",{"$f":"RIGHT($E$22,LEN($E$22)-$E$3+1)","v":"D8"},{"$f":"LEFT($E$22,$E$3-1)","v":"H4G5F6E7"},"Rät1","Pos",{"$f":"RIGHT($E$23,LEN($E$23)-$E$4+1)","v":"D8E8F8G8H8"},{"$f":"LEFT($E$23,$E$4-1)","v":"A8B8C8"},"Rät2","Pos",{"$f":"RIGHT($E$24,LEN($E$24)-$E$5+1)","v":"D8"},{"$f":"LEFT($E$24,$E$5-1)","v":"D1D2D3D4D5D6D7"},"Nåbar","Vad","Poäng","PosPoäng"]
["Pjäs:",{"$f":"Logik!AF2","v":"D8"},null,"PosDiag1",{"$f":"FIND(B3,E21)","v":1},{"$f":"UPPER(Logik!E1)","v":"A1"},{"$f":"UPPER(F2)","v":"A1"},{"$f":"IF($G2<>\"\",IF($G2<>$B$3,IF(IFERROR(FIND($G2,$E$21)>0,FALSE),TRUE,FALSE),FALSE),FALSE)","v":false},{"$f":"IF(H2,FIND($G2,$E$21),\"\")","v":""},{"$f":"IFERROR(IF(AND($I2<>\"\",$I2>0,$I2>$E$2),LEFT(J1,MIN($I2-$E$2+2,LEN(J1))),J1),J1)","v":"D8C7B6A5"},{"$f":"IF(AND($I2<>\"\",$I2>0,$I2<$E$2),RIGHT(K1,MIN($E$2-$I2,LEN(K1))),K1)","v":""},{"$f":"IF($G2<>\"\",IF($G2<>$B$3,IF(IFERROR(FIND($G2,$E$22)>0,FALSE),TRUE,FALSE),FALSE),FALSE)","v":false},{"$f":"IF(L2,FIND($G2,$E$22),\"\")","v":""},{"$f":"IFERROR(IF(AND($M2<>\"\",$M2>0,$M2>$E$3),LEFT(N1,MIN($M2-$E$3+2,LEN(N1))),N1),N1)","v":"D8"},{"$f":"IF(AND($M2<>\"\",$M2>0,$M2<$E$3),RIGHT(O1,MIN($E$3-$M2,LEN(O1))),O1)","v":"H4G5F6E7"},{"$f":"IF($G2<>\"\",IF($G2<>$B$3,IF(IFERROR(FIND($G2,$E$23)>0,FALSE),TRUE,FALSE),FALSE),FALSE)","v":false},{"$f":"IF(P2,FIND($G2,$E$23),\"\")","v":""},{"$f":"IFERROR(IF(AND($Q2<>\"\",$Q2>0,$Q2>$E$4),LEFT(R1,MIN($Q2-$E$4+2,LEN(R1))),R1),R1)","v":"D8E8F8G8H8"},{"$f":"IF(AND($Q2<>\"\",$Q2>0,$Q2<$E$4),RIGHT(S1,MIN($E$4-$Q2,LEN(S1))),S1)","v":"A8B8C8"},{"$f":"IF($G2<>\"\",IF($G2<>$B$3,IF(IFERROR(FIND($G2,$E$24)>0,FALSE),TRUE,FALSE),FALSE),FALSE)","v":false},{"$f":"IF(T2,FIND($G2,$E$24),\"\")","v":""},{"$f":"IFERROR(IF(AND($U2<>\"\",$U2>0,$U2>$E$5),LEFT(V1,MIN($U2-$E$5+2,LEN(V1))),V1),V1)","v":"D8"},{"$f":"IF(AND($U2<>\"\",$U2>0,$U2<$E$5),RIGHT(W1,MIN($E$5-$U2,LEN(W1))),W1)","v":"D1D2D3D4D5D6D7"},{"$f":"IFERROR(IF(AND(G2<>\"\",$G2<>$B$3),FIND(G2,$E$8),\"\"),\"\")","v":""},"A1",{"$f":"IF(X2<>\"\",HLOOKUP(HLOOKUP(Y2,PjasStart,2,FALSE),Pjaser,3,FALSE),0)","v":0},{"$f":"IF(X2<>\"\",OFFSET(Logik!$D$4,0,ROW()-1),0)","v":0}]
["Pos:",{"$f":"UPPER(Logik!AF1)","v":"D8"},null,"PosDiag2",{"$f":"IFERROR(FIND(B3,E22),0)","v":9},{"$f":"Logik!F1","v":"B1"},{"$f":"UPPER(F3)","v":"B1"},false,"","D8C7B6A5","",false,"","D8","H4G5F6E7",{"$f":"IF($G3<>\"\",IF($G3<>$B$3,IF(IFERROR(FIND($G3,$E$23)>0,FALSE),TRUE,FALSE),FALSE),FALSE)","v":false},{"$f":"IF(P3,FIND($G3,$E$23),\"\")","v":""},{"$f":"IFERROR(IF(AND($Q3<>\"\",$Q3>0,$Q3>$E$4),LEFT(R2,MIN($Q3-$E$4+2,LEN(R2))),R2),R2)","v":"D8E8F8G8H8"},{"$f":"IF(AND($Q3<>\"\",$Q3>0,$Q3<$E$4),RIGHT(S2,MIN($E$4-$Q3,LEN(S2))),S2)","v":"A8B8C8"},{"$f":"IF($G3<>\"\",IF($G3<>$B$3,IF(IFERROR(FIND($G3,$E$24)>0,FALSE),TRUE,FALSE),FALSE),FALSE)","v":false},{"$f":"IF(T3,FIND($G3,$E$24),\"\")","v":""},{"$f":"IFERROR(IF(AND($U3<>\"\",$U3>0,$U3>$E$5),LEFT(V2,MIN($U3-$E$5+2,LEN(V2))),V2),V2)","v":"D8"},{"$f":"IF(AND($U3<>\"\",$U3>0,$U3<$E$5),RIGHT(W2,MIN($E$5-$U3,LEN(W2))),W2)","v":"D1D2D3D4D5D6D7"},{"$f":"IFERROR(IF(AND(G3<>\"\",$G3<>$B$3),FIND(G3,$E$8),\"\"),\"\")","v":""},"B1",0,{"$f":"IF(X3<>\"\",OFFSET(Logik!$D$4,0,ROW()-1),0)","v":0}]
["PosX:",{"$f":"LEFT(B3,1)","v":"D"},null,"PosX",{"$f":"IFERROR(FIND(B3,E23),0)","v":7},{"$f":"Logik!G1","v":"C1"},"C1",false,"","D8C7B6A5","",false,"","D8","H4G5F6E7",false,"","D8E8F8G8H8","A8B8C8",false,"","D8","D1D2D3D4D5D6D7","","C1",0,{"$f":"IF(X4<>\"\",OFFSET(Logik!$D$4,0,ROW()-1),0)","v":0}]
["PosY:",{"$f":"RIGHT(B3,1)","v":"8"},null,"PosY",{"$f":"IFERROR(FIND(B3,E24),0)","v":15},{"$f":"Logik!H1","v":"D1"},"D1",false,"","D8C7B6A5","",false,"","D8","H4G5F6E7",false,"","D8E8F8G8H8","A8B8C8",true,1,"D8","D1D2D3D4D5D6D7","","D1",0,{"$f":"IF(X5<>\"\",OFFSET(Logik!$D$4,0,ROW()-1),0)","v":0}]
[null,null,null,"RA",{"$f":"K33&J33&O33&N33","v":"D8C7E7D8"},{"$f":"Logik!I1","v":"E1"},"E1",false,"","D8C7B6A5","",false,"","D8","H4G5F6E7",false,"","D8E8F8G8H8","A8B8C8",false,"","D8","D1D2D3D4D5D6D7","","E1",0,{"$f":"IF(X6<>\"\",OFFSET(Logik!$D$4,0,ROW()-1),0)","v":0}]
["Poäng",{"$f":"Logik!AF3","v":900},null,"RB",{"$f":"S33&R33&W33&V33","v":"C8D8E8D7D8"},{"$f":"Logik!J1","v":"F1"},"F1",false,"","D8C7B6A5","",false,"","D8","H4G5F6E7",false,"","D8E8F8G8H8","A8B8C8",false,"","D8","D1D2D3D4D5D6D7","","F1",0,{"$f":"IF(X7<>\"\",OFFSET(Logik!$D$4,0,ROW()-1),0)","v":0}]
["PosPoäng",{"$f":"Logik!AF4","v":12},null,"RAB",{"$f":"E6&E7","v":"D8C7E7D8C8D8E8D7D8"},{"$f":"Logik!K1","v":"G1"},"G1",false,"","D8C7B6A5","",false,"","D8","H4G5F6E7",false,"","D8E8F8G8H8","A8B8C8",false,"","D8","D1D2D3D4D5D6D7","","G1",0,{"$f":"IF(X8<>\"\",OFFSET(Logik!$D$4,0,ROW()-1),0)","v":0}]
[null,null,null,"Försvar",{"$f":"SUM(Z18:Z33)+SUM(AA18:AA33)","v":742},{"$f":"Logik!L1","v":"H1"},"H1",false,"","D8C7B6A5","",false,"","D8","H4G5F6E7",false,"","D8E8F8G8H8","A8B8C8",false,"","D8","D1D2D3D4D5D6D7","","H1",0,{"$f":"IF(X9<>\"\",OFFSET(Logik!$D$4,0,ROW()-1),0)","v":0}]
[null,null,null,"Attack",{"$f":"SUM(Z2:Z17)+SUM(AA2:AA17)","v":0},{"$f":"Logik!M1","v":"A2"},"A2",false,"","D8C7B6A5","",false,"","D8","H4G5F6E7",false,"","D8E8F8G8H8","A8B8C8",false,"","D8","D1D2D3D4D5D6D7","","A2",0,{"$f":"IF(X10<>\"\",OFFSET(Logik!$D$4,0,ROW()-1),0)","v":0}]
[null,null,null,"R Antal",{"$f":"LEN(E8)/2","v":9},{"$f":"Logik!N1","v":"B2"},"B2",false,"","D8C7B6A5","",false,"","D8","H4G5F6E7",false,"","D8E8F8G8H8","A8B8C8",false,"","D8","D1D2D3D4D5D6D7","","B2",0,{"$f":"IF(X11<>\"\",OFFSET(Logik!$D$4,0,ROW()-1),0)","v":0}]
[null,null,null,null,null,{"$f":"Logik!O1","v":"C2"},"C2",false,"","D8C7B6A5","",false,"","D8","H4G5F6E7",false,"","D8E8F8G8H8","A8B8C8",false,"","D8","D1D2D3D4D5D6D7","","C2",0,{"$f":"IF(X12<>\"\",OFFSET(Logik!$D$4,0,ROW()-1),0)","v":0}]
[null,null,null,"FRvA",{"$f":"IFERROR(INDEX(tblRVD,MATCH(\"VD\"&$B$3,RVD!$A$2:$A$65,0),5),\"\")","v":"D8C7B6A5"},{"$f":"Logik!P1","v":"D2"},"D2",false,"","D8C7B6A5","",false,"","D8","H4G5F6E7",false,"","D8E8F8G8H8","A8B8C8",true,3,"D8","D2D3D4D5D6D7","","D2",0,{"$f":"IF(X13<>\"\",OFFSET(Logik!$D$4,0,ROW()-1),0)","v":0}]
[null,null,null,"FRvB",{"$f":"IFERROR(INDEX(tblRVD,MATCH(\"VD\"&$B$3,RVD!$A$2:$A$65,0),6),\"\")","v":"D8"},{"$f":"Logik!Q1","v":"E2"},"E2",false,"","D8C7B6A5","",false,"","D8","H4G5F6E7",false,"","D8E8F8G8H8","A8B8C8",false,"","D8","D2D3D4D5D6D7","","E2",0,{"$f":"IF(X14<>\"\",OFFSET(Logik!$D$4,0,ROW()-1),0)","v":0}]
[null,null,null,"FRvC",{"$f":"IFERROR(INDEX(tblRVD,MATCH(\"VD\"&$B$3,RVD!$A$2:$A$65,0),7),\"\")","v":"H4G5F6E7"},{"$f":"Logik!R1","v":"F2"},"F2",false,"","D8C7B6A5","",false,"","D8","H4G5F6E7",false,"","D8E8F8G8H8","A8B8C8",false,"","D8","D2D3D4D5D6D7","","F2",0,{"$f":"IF(X15<>\"\",OFFSET(Logik!$D$4,0,ROW()-1),0)","v":0}]
[null,null,null,"FRvD",{"$f":"IFERROR(INDEX(tblRVD,MATCH(\"VD\"&$B$3,RVD!$A$2:$A$65,0),8),\"\")","v":""},{"$f":"Logik!S1","v":"G2"},"G2",false,"","D8C7B6A5","",false,"","D8","H4G5F6E7",false,"","D8E8F8G8H8","A8B8C8",false,"","D8","D2D3D4D5D6D7","","G2",0,{"$f":"IF(X16<>\"\",OFFSET(Logik!$D$4,0,ROW()-1),0)","v":0}]
[null,null,null,"FRvE",{"$f":"IFERROR(INDEX(tblRVD,MATCH(\"VD\"&$B$3,RVD!$A$2:$A$65,0),9),\"\")","v":"A8B8C8D8"},{"$f":"Logik!T1","v":"H2"},"H2",false,"","D8C7B6A5","",false,"","D8","H4G5F6E7",false,"","D8E8F8G8H8","A8B8C8",false,"","D8","D2D3D4D5D6D7","","H2",0,{"$f":"IF(X17<>\"\",OFFSET(Logik!$D$4,0,ROW()-1),0)","v":0},"MöjligaDrag"]
[null,null,null,"FRvF",{"$f":"IFERROR(INDEX(tblRVD,MATCH(\"VD\"&$B$3,RVD!$A$2:$A$65,0),10),\"\")","v":"E8F8G8H8"},{"$f":"Logik!U1","v":"A7"},"A7",false,"","D8C7B6A5","",false,"","D8","H4G5F6E7",false,"","D8E8F8G8H8","A8B8C8",false,"","D8","D2D3D4D5D6D7","","A7",{"$f":"IF(X18<>\"\",HLOOKUP(HLOOKUP(Y18,PjasStart,2,FALSE),Pjaser,4,FALSE),0)","v":0},{"$f":"IF(X18<>\"\",OFFSET(Logik!$D$4,0,ROW()-1),0)","v":0},{"$f":"SUBSTITUTE(E8,G18,\"\")","v":"D8C7E7D8C8D8E8D7D8"}]
[null,null,null,"FRvG",{"$f":"IFERROR(INDEX(tblRVD,MATCH(\"VD\"&$B$3,RVD!$A$2:$A$65,0),11),\"\")","v":"D1D2D3D4D5D6D7D8"},{"$f":"Logik!V1","v":"B7"},"B7",false,"","D8C7B6A5","",false,"","D8","H4G5F6E7",false,"","D8E8F8G8H8","A8B8C8",false,"","D8","D2D3D4D5D6D7","","B7",0,{"$f":"IF(X19<>\"\",OFFSET(Logik!$D$4,0,ROW()-1),0)","v":0},{"$f":"SUBSTITUTE(AB18,G19,\"\")","v":"D8C7E7D8C8D8E8D7D8"}]
[null,null,null,"FRvH",{"$f":"IFERROR(INDEX(tblRVD,MATCH(\"VD\"&$B$3,RVD!$A$2:$A$65,0),12),\"\")","v":""},{"$f":"Logik!W1","v":"C7"},"C7",true,3,"D8C7","",false,"","D8","H4G5F6E7",false,"","D8E8F8G8H8","A8B8C8",false,"","D8","D2D3D4D5D6D7",3,"C7",100,{"$f":"IF(X20<>\"\",OFFSET(Logik!$D$4,0,ROW()-1),0)","v":0},{"$f":"SUBSTITUTE(AB19,G20,\"\")","v":"D8E7D8C8D8E8D7D8"}]
[null,null,null,"FR1",{"$f":"E16&E13","v":"D8C7B6A5"},{"$f":"Logik!X1","v":"D7"},"D7",false,"","D8C7","",false,"","D8","H4G5F6E7",false,"","D8E8F8G8H8","A8B8C8",true,13,"D8","D7",15,"D7",100,{"$f":"IF(X21<>\"\",OFFSET(Logik!$D$4,0,ROW()-1),0)","v":0},"D8E7D8C8D8E8D8"]
[null,null,null,"FR2",{"$f":"E15&E14","v":"H4G5F6E7D8"},{"$f":"Logik!Y1","v":"E7"},"E7",false,"","D8C7","",true,7,"D8","E7",false,"","D8E8F8G8H8","A8B8C8",false,"","D8","D7",5,"E7",100,{"$f":"IF(X22<>\"\",OFFSET(Logik!$D$4,0,ROW()-1),0)","v":0},"D8D8C8D8E8D8"]
[null,null,null,"FR3",{"$f":"E17&E18","v":"A8B8C8D8E8F8G8H8"},{"$f":"Logik!Z1","v":"F7"},"F7",false,"","D8C7","",false,"","D8","E7",false,"","D8E8F8G8H8","A8B8C8",false,"","D8","D7","","F7",0,{"$f":"IF(X23<>\"\",OFFSET(Logik!$D$4,0,ROW()-1),0)","v":0},"D8D8C8D8E8D8"]
[null,null,null,"FR4",{"$f":"E19&E20","v":"D1D2D3D4D5D6D7D8"},{"$f":"Logik!AA1","v":"G7"},"G7",false,"","D8C7","",false,"","D8","E7",false,"","D8E8F8G8H8","A8B8C8",false,"","D8","D7","","G7",0,{"$f":"IF(X24<>\"\",OFFSET(Logik!$D$4,0,ROW()-1),0)","v":0},"D8D8C8D8E8D8"]
[null,null,null,null,null,{"$f":"Logik!AB1","v":"H7"},"H7",false,"","D8C7","",false,"","D8","E7",false,"","D8E8F8G8H8","A8B8C8",false,"","D8","D7","","H7",0,{"$f":"IF(X25<>\"\",OFFSET(Logik!$D$4,0,ROW()-1),0)","v":0},"D8D8C8D8E8D8"]
[null,null,null,"MöjligaDrag",{"$f":"AB33","v":""},{"$f":"Logik!AC1","v":"A8"},"A8",false,"","D8C7","",false,"","D8","E7",true,1,"D8E8F8G8H8","A8B8C8",false,"","D8","D7","","A8",0,{"$f":"IF(X26<>\"\",OFFSET(Logik!$D$4,0,ROW()-1),0)","v":0},"D8D8C8D8E8D8"]
[null,null,null,"D Antal",{"$f":"LEN(E26)/2","v":0},{"$f":"Logik!AD1","v":"B8"},"B8",false,"","D8C7","",false,"","D8","E7",true,3,"D8E8F8G8H8","B8C8",false,"","D8","D7","","B8",0,{"$f":"IF(X27<>\"\",OFFSET(Logik!$D$4,0,ROW()-1),0)","v":0},"D8D8C8D8E8D8"]
[null,null,null,null,null,{"$f":"Logik!AE1","v":"C8"},"C8",false,"","D8C7","",false,"","D8","E7",true,5,"D8E8F8G8H8","C8",false,"","D8","D7",9,"C8",300,{"$f":"IF(X28<>\"\",OFFSET(Logik!$D$4,0,ROW()-1),0)","v":10},"D8D8D8E8D8"]
[null,null,null,null,null,{"$f":"Logik!AF1","v":"D8"},"D8",false,"","D8C7","",false,"","D8","E7",false,"","D8E8F8G8H8","C8",false,"","D8","D7","","D8",0,{"$f":"IF(X29<>\"\",OFFSET(Logik!$D$4,0,ROW()-1),0)","v":0},"E8"]
[null,null,null,null,null,{"$f":"Logik!AG1","v":"E8"},"E8",false,"","D8C7","",false,"","D8","E7",true,9,"D8E8","C8",false,"","D8","D7",13,"E8",100,{"$f":"IF(X30<>\"\",OFFSET(Logik!$D$4,0,ROW()-1),0)","v":32},""]
[null,null,null,null,null,{"$f":"Logik!AH1","v":"F8"},"F8",false,"","D8C7","",false,"","D8","E7",true,11,"D8E8","C8",false,"","D8","D7","","F8",0,{"$f":"IF(X31<>\"\",OFFSET(Logik!$D$4,0,ROW()-1),0)","v":0},""]
[null,null,null,null,null,{"$f":"Logik!AI1","v":"G8"},"G8",false,"","D8C7","",false,"","D8","E7",true,13,"D8E8","C8",false,"","D8","D7","","G8",0,{"$f":"IF(X32<>\"\",OFFSET(Logik!$D$4,0,ROW()-1),0)","v":0},""]
[null,null,null,null,null,{"$f":"Logik!AJ1","v":"H8"},"H8",false,"","D8C7","",false,"","D8","E7",true,15,"D8E8","C8",false,"","D8","D7","","H8",0,{"$f":"IF(X33<>\"\",OFFSET(Logik!$D$4,0,ROW()-1),0)","v":0},""]

{"sheet":"P_E8","index":25,"n_rows":33,"n_cols":28,"rows_kept":33,"cut":false,"hidden":true,"merged":[]}
[null,null,null,null,null,{"$f":"Logik!D1","v":"Pos:"},"Pjäs:","Diagonal1","Pos",{"$f":"RIGHT($E$21,LEN($E$21)-$E$2+1)","v":"E8"},{"$f":"LEFT($E$21,$E$2-1)","v":"D7"},"Diagonal2","Pos",{"$f":"RIGHT($E$22,LEN($E$22)-$E$3+1)","v":"E8F8"},{"$f":"LEFT($E$22,$E$3-1)","v":"D8"},"Rät1","Pos",{"$f":"RIGHT($E$23,LEN($E$23)-$E$4+1)","v":"E8F7"},{"$f":"LEFT($E$23,$E$4-1)","v":""},"Rät2","Pos",{"$f":"RIGHT($E$24,LEN($E$24)-$E$5+1)","v":"E8E7"},{"$f":"LEFT($E$24,$E$5-1)","v":""},"Nåbar","Vad","Poäng","PosPoäng"]
["Pjäs:",{"$f":"Logik!AG2","v":"E8"},null,"PosDiag1",{"$f":"FIND(B3,E21)","v":3},{"$f":"UPPER(Logik!E1)","v":"A1"},{"$f":"UPPER(F2)","v":"A1"},{"$f":"IF($G2<>\"\",IF($G2<>$B$3,IF(IFERROR(FIND($G2,$E$21)>0,FALSE),TRUE,FALSE),FALSE),FALSE)","v":false},{"$f":"IF(H2,FIND($G2,$E$21),\"\")","v":""},{"$f":"IFERROR(IF(AND($I2<>\"\",$I2>0,$I2>$E$2),LEFT(J1,MIN($I2-$E$2+2,LEN(J1))),J1),J1)","v":"E8"},{"$f":"IF(AND($I2<>\"\",$I2>0,$I2<$E$2),RIGHT(K1,MIN($E$2-$I2,LEN(K1))),K1)","v":"D7"},{"$f":"IF($G2<>\"\",IF($G2<>$B$3,IF(IFERROR(FIND($G2,$E$22)>0,FALSE),TRUE,FALSE),FALSE),FALSE)","v":false},{"$f":"IF(L2,FIND($G2,$E$22),\"\")","v":""},{"$f":"IFERROR(IF(AND($M2<>\"\",$M2>0,$M2>$E$3),LEFT(N1,MIN($M2-$E$3+2,LEN(N1))),N1),N1)","v":"E8F8"},{"$f":"IF(AND($M2<>\"\",$M2>0,$M2<$E$3),RIGHT(O1,MIN($E$3-$M2,LEN(O1))),O1)","v":"D8"},{"$f":"IF($G2<>\"\",IF($G2<>$B$3,IF(IFERROR(FIND($G2,$E$23)>0,FALSE),TRUE,FALSE),FALSE),FALSE)","v":false},{"$f":"IF(P2,FIND($G2,$E$23),\"\")","v":""},{"$f":"IFERROR(IF(AND($Q2<>\"\",$Q2>0,$Q2>$E$4),LEFT(R1,MIN($Q2-$E$4+2,LEN(R1))),R1),R1)","v":"E8F7"},{"$f":"IF(AND($Q2<>\"\",$Q2>0,$Q2<$E$4),RIGHT(S1,MIN($E$4-$Q2,LEN(S1))),S1)","v":""},{"$f":"IF($G2<>\"\",IF($G2<>$B$3,IF(IFERROR(FIND($G2,$E$24)>0,FALSE),TRUE,FALSE),FALSE),FALSE)","v":false},{"$f":"IF(T2,FIND($G2,$E$24),\"\")","v":""},{"$f":"IFERROR(IF(AND($U2<>\"\",$U2>0,$U2>$E$5),LEFT(V1,MIN($U2-$E$5+2,LEN(V1))),V1),V1)","v":"E8E7"},{"$f":"IF(AND($U2<>\"\",$U2>0,$U2<$E$5),RIGHT(W1,MIN($E$5-$U2,LEN(W1))),W1)","v":""},{"$f":"IFERROR(IF(AND(G2<>\"\",$G2<>$B$3),FIND(G2,$E$8),\"\"),\"\")","v":""},"A1",{"$f":"IF(X2<>\"\",HLOOKUP(HLOOKUP(Y2,PjasStart,2,FALSE),Pjaser,4,FALSE),0)","v":0},{"$f":"IF(X2<>\"\",OFFSET(Logik!$D$4,0,ROW()-1),0)","v":0}]
["Pos:",{"$f":"UPPER(Logik!AG1)","v":"E8"},null,"PosDiag2",{"$f":"IFERROR(FIND(B3,E22),0)","v":3},{"$f":"Logik!F1","v":"B1"},{"$f":"UPPER(F3)","v":"B1"},false,"","E8","D7",false,"","E8F8","D8",{"$f":"IF($G3<>\"\",IF($G3<>$B$3,IF(IFERROR(FIND($G3,$E$23)>0,FALSE),TRUE,FALSE),FALSE),FALSE)","v":false},{"$f":"IF(P3,FIND($G3,$E$23),\"\")","v":""},{"$f":"IFERROR(IF(AND($Q3<>\"\",$Q3>0,$Q3>$E$4),LEFT(R2,MIN($Q3-$E$4+2,LEN(R2))),R2),R2)","v":"E8F7"},{"$f":"IF(AND($Q3<>\"\",$Q3>0,$Q3<$E$4),RIGHT(S2,MIN($E$4-$Q3,LEN(S2))),S2)","v":""},{"$f":"IF($G3<>\"\",IF($G3<>$B$3,IF(IFERROR(FIND($G3,$E$24)>0,FALSE),TRUE,FALSE),FALSE),FALSE)","v":false},{"$f":"IF(T3,FIND($G3,$E$24),\"\")","v":""},{"$f":"IFERROR(IF(AND($U3<>\"\",$U3>0,$U3>$E$5),LEFT(V2,MIN($U3-$E$5+2,LEN(V2))),V2),V2)","v":"E8E7"},{"$f":"IF(AND($U3<>\"\",$U3>0,$U3<$E$5),RIGHT(W2,MIN($E$5-$U3,LEN(W2))),W2)","v":""},{"$f":"IFERROR(IF(AND(G3<>\"\",$G3<>$B$3),FIND(G3,$E$8),\"\"),\"\")","v":""},"B1",0,{"$f":"IF(X3<>\"\",OFFSET(Logik!$D$4,0,ROW()-1),0)","v":0}]
["PosX:",{"$f":"LEFT(B3,1)","v":"E"},null,"PosX",{"$f":"IFERROR(FIND(B3,E23),0)","v":1},{"$f":"Logik!G1","v":"C1"},"C1",false,"","E8","D7",false,"","E8F8","D8",false,"","E8F7","",false,"","E8E7","","","C1",0,{"$f":"IF(X4<>\"\",OFFSET(Logik!$D$4,0,ROW()-1),0)","v":0}]
["PosY:",{"$f":"RIGHT(B3,1)","v":"8"},null,"PosY",{"$f":"IFERROR(FIND(B3,E24),0)","v":1},{"$f":"Logik!H1","v":"D1"},"D1",false,"","E8","D7",false,"","E8F8","D8",false,"","E8F7","",false,"","E8E7","","","D1",0,{"$f":"IF(X5<>\"\",OFFSET(Logik!$D$4,0,ROW()-1),0)","v":0}]
[null,null,null,"RA",{"$f":"K33&J33&O33&N33","v":"D7E8D8E8F8"},{"$f":"Logik!I1","v":"E1"},"E1",false,"","E8","D7",false,"","E8F8","D8",false,"","E8F7","",false,"","E8E7","","","E1",0,{"$f":"IF(X6<>\"\",OFFSET(Logik!$D$4,0,ROW()-1),0)","v":0}]
["Poäng",{"$f":"Logik!I3","v":20000},null,"RB",{"$f":"S33&R33&W33&V33","v":"E8F7E8E7"},{"$f":"Logik!J1","v":"F1"},"F1",false,"","E8","D7",false,"","E8F8","D8",false,"","E8F7","",false,"","E8E7","","","F1",0,{"$f":"IF(X7<>\"\",OFFSET(Logik!$D$4,0,ROW()-1),0)","v":0}]
["PosPoäng",{"$f":"Logik!I4","v":32},null,"RAB",{"$f":"E6&E7","v":"D7E8D8E8F8E8F7E8E7"},{"$f":"Logik!K1","v":"G1"},"G1",false,"","E8","D7",false,"","E8F8","D8",false,"","E8F7","",false,"","E8E7","","","G1",0,{"$f":"IF(X8<>\"\",OFFSET(Logik!$D$4,0,ROW()-1),0)","v":0}]
[null,null,null,"Försvar",{"$f":"SUM(Z2:Z17)+SUM(AA2:AA17)","v":0},{"$f":"Logik!L1","v":"H1"},"H1",false,"","E8","D7",false,"","E8F8","D8",false,"","E8F7","",false,"","E8E7","","","H1",0,{"$f":"IF(X9<>\"\",OFFSET(Logik!$D$4,0,ROW()-1),0)","v":0}]
[null,null,null,"Attack",{"$f":"SUM(Z18:Z33)+SUM(AA18:AA33)","v":1522},{"$f":"Logik!M1","v":"A2"},"A2",false,"","E8","D7",false,"","E8F8","D8",false,"","E8F7","",false,"","E8E7","","","A2",0,{"$f":"IF(X10<>\"\",OFFSET(Logik!$D$4,0,ROW()-1),0)","v":0}]
[null,null,null,"R Antal",{"$f":"LEN(E8)/2","v":9},{"$f":"Logik!N1","v":"B2"},"B2",false,"","E8","D7",false,"","E8F8","D8",false,"","E8F7","",false,"","E8E7","","","B2",0,{"$f":"IF(X11<>\"\",OFFSET(Logik!$D$4,0,ROW()-1),0)","v":0}]
[null,null,null,null,null,{"$f":"Logik!O1","v":"C2"},"C2",false,"","E8","D7",false,"","E8F8","D8",false,"","E8F7","",false,"","E8E7","","","C2",0,{"$f":"IF(X12<>\"\",OFFSET(Logik!$D$4,0,ROW()-1),0)","v":0}]
[null,null,null,"FRvA",{"$f":"IFERROR(INDEX(tblRVK,MATCH(\"VK\"&$B$3,RVK!$A$2:$A$65,0),6),\"\")","v":"E7"},{"$f":"Logik!P1","v":"D2"},"D2",false,"","E8","D7",false,"","E8F8","D8",false,"","E8F7","",false,"","E8E7","","","D2",0,{"$f":"IF(X13<>\"\",OFFSET(Logik!$D$4,0,ROW()-1),0)","v":0}]
[null,null,null,"FRvB",{"$f":"IFERROR(INDEX(tblRVK,MATCH(\"VK\"&$B$3,RVK!$A$2:$A$65,0),7),\"\")","v":"F7"},{"$f":"Logik!Q1","v":"E2"},"E2",false,"","E8","D7",false,"","E8F8","D8",false,"","E8F7","",false,"","E8E7","","","E2",0,{"$f":"IF(X14<>\"\",OFFSET(Logik!$D$4,0,ROW()-1),0)","v":0}]
[null,null,null,"FRvC",{"$f":"IFERROR(INDEX(tblRVK,MATCH(\"VK\"&$B$3,RVK!$A$2:$A$65,0),8),\"\")","v":"F8"},{"$f":"Logik!R1","v":"F2"},"F2",false,"","E8","D7",false,"","E8F8","D8",false,"","E8F7","",false,"","E8E7","","","F2",0,{"$f":"IF(X15<>\"\",OFFSET(Logik!$D$4,0,ROW()-1),0)","v":0}]
[null,null,null,"FRvD",{"$f":"IFERROR(INDEX(tblRVK,MATCH(\"VK\"&$B$3,RVK!$A$2:$A$65,0),9),\"\")","v":""},{"$f":"Logik!S1","v":"G2"},"G2",false,"","E8","D7",false,"","E8F8","D8",false,"","E8F7","",false,"","E8E7","","","G2",0,{"$f":"IF(X16<>\"\",OFFSET(Logik!$D$4,0,ROW()-1),0)","v":0}]
[null,null,null,"FRvE",{"$f":"IFERROR(INDEX(tblRVK,MATCH(\"VK\"&$B$3,RVK!$A$2:$A$65,0),10),\"\")","v":""},{"$f":"Logik!T1","v":"H2"},"H2",false,"","E8","D7",false,"","E8F8","D8",false,"","E8F7","",false,"","E8E7","","","H2",0,{"$f":"IF(X17<>\"\",OFFSET(Logik!$D$4,0,ROW()-1),0)","v":0},"MöjligaDrag"]
[null,null,null,"FRvF",{"$f":"IFERROR(INDEX(tblRVK,MATCH(\"VK\"&$B$3,RVK!$A$2:$A$65,0),11),\"\")","v":""},{"$f":"Logik!U1","v":"A7"},"A7",false,"","E8","D7",false,"","E8F8","D8",false,"","E8F7","",false,"","E8E7","","","A7",{"$f":"IF(X18<>\"\",HLOOKUP(HLOOKUP(Y18,PjasStart,2,FALSE),Pjaser,3,FALSE),0)","v":0},{"$f":"IF(X18<>\"\",OFFSET(Logik!$D$4,0,ROW()-1),0)","v":0},{"$f":"SUBSTITUTE(E8,G18,\"\")","v":"D7E8D8E8F8E8F7E8E7"}]
[null,null,null,"FRvG",{"$f":"IFERROR(INDEX(tblRVK,MATCH(\"VK\"&$B$3,RVK!$A$2:$A$65,0),12),\"\")","v":"D8"},{"$f":"Logik!V1","v":"B7"},"B7",false,"","E8","D7",false,"","E8F8","D8",false,"","E8F7","",false,"","E8E7","","","B7",0,{"$f":"IF(X19<>\"\",OFFSET(Logik!$D$4,0,ROW()-1),0)","v":0},{"$f":"SUBSTITUTE(AB18,G19,\"\")","v":"D7E8D8E8F8E8F7E8E7"}]
[null,null,null,"FRvH",{"$f":"IFERROR(INDEX(tblRVK,MATCH(\"VK\"&$B$3,RVK!$A$2:$A$65,0),13),\"\")","v":"D7"},{"$f":"Logik!W1","v":"C7"},"C7",false,"","E8","D7",false,"","E8F8","D8",false,"","E8F7","",false,"","E8E7","","","C7",0,{"$f":"IF(X20<>\"\",OFFSET(Logik!$D$4,0,ROW()-1),0)","v":0},{"$f":"SUBSTITUTE(AB19,G20,\"\")","v":"D7E8D8E8F8E8F7E8E7"}]
[null,null,null,"FR1",{"$f":"E20&B3&E16","v":"D7E8"},{"$f":"Logik!X1","v":"D7"},"D7",true,1,"E8","D7",false,"","E8F8","D8",false,"","E8F7","",false,"","E8E7","",1,"D7",100,{"$f":"IF(X21<>\"\",OFFSET(Logik!$D$4,0,ROW()-1),0)","v":0},"E8D8E8F8E8F7E8E7"]
[null,null,null,"FR2",{"$f":"E19&B3&E15","v":"D8E8F8"},{"$f":"Logik!Y1","v":"E7"},"E7",false,"","E8","D7",false,"","E8F8","D8",false,"","E8F7","",true,3,"E8E7","",17,"E7",100,{"$f":"IF(X22<>\"\",OFFSET(Logik!$D$4,0,ROW()-1),0)","v":0},"E8D8E8F8E8F7E8"]
[null,null,null,"FR3",{"$f":"E18&B3&E14","v":"E8F7"},{"$f":"Logik!Z1","v":"F7"},"F7",false,"","E8","D7",false,"","E8F8","D8",true,3,"E8F7","",false,"","E8E7","",13,"F7",100,{"$f":"IF(X23<>\"\",OFFSET(Logik!$D$4,0,ROW()-1),0)","v":0},"E8D8E8F8E8E8"]
[null,null,null,"FR4",{"$f":"E17&B3&E13","v":"E8E7"},{"$f":"Logik!AA1","v":"G7"},"G7",false,"","E8","D7",false,"","E8F8","D8",false,"","E8F7","",false,"","E8E7","","","G7",0,{"$f":"IF(X24<>\"\",OFFSET(Logik!$D$4,0,ROW()-1),0)","v":0},"E8D8E8F8E8E8"]
[null,null,null,null,null,{"$f":"Logik!AB1","v":"H7"},"H7",false,"","E8","D7",false,"","E8F8","D8",false,"","E8F7","",false,"","E8E7","","","H7",0,{"$f":"IF(X25<>\"\",OFFSET(Logik!$D$4,0,ROW()-1),0)","v":0},"E8D8E8F8E8E8"]
[null,null,null,"MöjligaDrag",{"$f":"AB33","v":""},{"$f":"Logik!AC1","v":"A8"},"A8",false,"","E8","D7",false,"","E8F8","D8",false,"","E8F7","",false,"","E8E7","","","A8",0,{"$f":"IF(X26<>\"\",OFFSET(Logik!$D$4,0,ROW()-1),0)","v":0},"E8D8E8F8E8E8"]
[null,null,null,"D Antal",{"$f":"LEN(E26)/2","v":0},{"$f":"Logik!AD1","v":"B8"},"B8",false,"","E8","D7",false,"","E8F8","D8",false,"","E8F7","",false,"","E8E7","","","B8",0,{"$f":"IF(X27<>\"\",OFFSET(Logik!$D$4,0,ROW()-1),0)","v":0},"E8D8E8F8E8E8"]
[null,null,null,null,null,{"$f":"Logik!AE1","v":"C8"},"C8",false,"","E8","D7",false,"","E8F8","D8",false,"","E8F7","",false,"","E8E7","","","C8",0,{"$f":"IF(X28<>\"\",OFFSET(Logik!$D$4,0,ROW()-1),0)","v":0},"E8D8E8F8E8E8"]
[null,null,null,null,null,{"$f":"Logik!AF1","v":"D8"},"D8",false,"","E8","D7",true,1,"E8F8","D8",false,"","E8F7","",false,"","E8E7","",5,"D8",900,{"$f":"IF(X29<>\"\",OFFSET(Logik!$D$4,0,ROW()-1),0)","v":12},"E8E8F8E8E8"]
[null,null,null,null,null,{"$f":"Logik!AG1","v":"E8"},"E8",false,"","E8","D7",false,"","E8F8","D8",false,"","E8F7","",false,"","E8E7","","","E8",0,{"$f":"IF(X30<>\"\",OFFSET(Logik!$D$4,0,ROW()-1),0)","v":0},"F8"]
[null,null,null,null,null,{"$f":"Logik!AH1","v":"F8"},"F8",false,"","E8","D7",true,5,"E8F8","D8",false,"","E8F7","",false,"","E8E7","",9,"F8",300,{"$f":"IF(X31<>\"\",OFFSET(Logik!$D$4,0,ROW()-1),0)","v":10},""]
[null,null,null,null,null,{"$f":"Logik!AI1","v":"G8"},"G8",false,"","E8","D7",false,"","E8F8","D8",false,"","E8F7","",false,"","E8E7","","","G8",0,{"$f":"IF(X32<>\"\",OFFSET(Logik!$D$4,0,ROW()-1),0)","v":0},""]
[null,null,null,null,null,{"$f":"Logik!AJ1","v":"H8"},"H8",false,"","E8","D7",false,"","E8F8","D8",false,"","E8F7","",false,"","E8E7","","","H8",0,{"$f":"IF(X33<>\"\",OFFSET(Logik!$D$4,0,ROW()-1),0)","v":0},""]

{"sheet":"P_F8","index":26,"n_rows":33,"n_cols":20,"rows_kept":33,"cut":false,"hidden":true,"merged":[]}
[null,null,null,null,null,{"$f":"Logik!D1","v":"Pos:"},"Pjäs:","Fräckvidd","Pos",{"$f":"RIGHT($E$23,LEN($E$23)-$E$4+1)","v":"F8E7D6C5B4A3"},{"$f":"LEFT($E$23,$E$4-1)","v":""},"Fräckvidd","Pos",{"$f":"RIGHT($E$24,LEN($E$24)-$E$5+1)","v":"F8"},{"$f":"LEFT($E$24,$E$5-1)","v":"H6G7"},"Nåbar","Vad","Poäng","PosPoäng"]
["Pjäs:",{"$f":"Logik!AH2","v":"F8"},null,null,null,{"$f":"UPPER(Logik!E1)","v":"A1"},{"$f":"UPPER(F2)","v":"A1"},{"$f":"IF($G2<>\"\",IF($G2<>$B$3,IF(IFERROR(FIND($G2,$E$23)>0,FALSE),TRUE,FALSE),FALSE),FALSE)","v":false},{"$f":"IF(H2,FIND($G2,$E$23),\"\")","v":""},{"$f":"IFERROR(IF(AND($I2<>\"\",$I2>0,$I2>$E$4),LEFT(J1,MIN($I2-$E$4+2,LEN(J1))),J1),J1)","v":"F8E7D6C5B4A3"},{"$f":"IF(AND($I2<>\"\",$I2>0,$I2<$E$4),RIGHT(K1,MIN($E$4-$I2,LEN(K1))),K1)","v":""},{"$f":"IF($G2<>\"\",IF($G2<>$B$3,IF(IFERROR(FIND($G2,$E$24)>0,FALSE),TRUE,FALSE),FALSE),FALSE)","v":false},{"$f":"IF(L2,FIND($G2,$E$24),\"\")","v":""},{"$f":"IFERROR(IF(AND($M2<>\"\",$M2>0,$M2>$E$5),LEFT(N1,MIN($M2-$E$5+2,LEN(N1))),N1),N1)","v":"F8"},{"$f":"IF(AND($M2<>\"\",$M2>0,$M2<$E$5),RIGHT(O1,MIN($E$5-$M2,LEN(O1))),O1)","v":"H6G7"},{"$f":"IFERROR(IF(AND(G2<>\"\",$G2<>$B$3),FIND(G2,$E$8),\"\"),\"\")","v":""},"A1",{"$f":"IF(P2<>\"\",HLOOKUP(HLOOKUP(Q2,PjasStart,2,FALSE),Pjaser,3,FALSE),0)","v":0},{"$f":"IF(P2<>\"\",OFFSET(Logik!$D$4,0,ROW()-1),0)","v":0}]
["Pos:",{"$f":"UPPER(Logik!AH1)","v":"F8"},null,null,null,{"$f":"Logik!F1","v":"B1"},{"$f":"UPPER(F3)","v":"B1"},{"$f":"IF($G3<>\"\",IF($G3<>$B$3,IF(IFERROR(FIND($G3,$E$23)>0,FALSE),TRUE,FALSE),FALSE),FALSE)","v":false},{"$f":"IF(H3,FIND($G3,$E$23),\"\")","v":""},{"$f":"IFERROR(IF(AND($I3<>\"\",$I3>0,$I3>$E$4),LEFT(J2,MIN($I3-$E$4+2,LEN(J2))),J2),J2)","v":"F8E7D6C5B4A3"},{"$f":"IF(AND($I3<>\"\",$I3>0,$I3<$E$4),RIGHT(K2,MIN($E$4-$I3,LEN(K2))),K2)","v":""},{"$f":"IF($G3<>\"\",IF($G3<>$B$3,IF(IFERROR(FIND($G3,$E$24)>0,FALSE),TRUE,FALSE),FALSE),FALSE)","v":false},{"$f":"IF(L3,FIND($G3,$E$24),\"\")","v":""},{"$f":"IFERROR(IF(AND($M3<>\"\",$M3>0,$M3>$E$5),LEFT(N2,MIN($M3-$E$5+2,LEN(N2))),N2),N2)","v":"F8"},{"$f":"IF(AND($M3<>\"\",$M3>0,$M3<$E$5),RIGHT(O2,MIN($E$5-$M3,LEN(O2))),O2)","v":"H6G7"},{"$f":"IFERROR(IF(AND(G3<>\"\",$G3<>$B$3),FIND(G3,$E$8),\"\"),\"\")","v":""},"B1",0,{"$f":"IF(P3<>\"\",OFFSET(Logik!$D$4,0,ROW()-1),0)","v":0}]
["PosX:",{"$f":"LEFT(B3,1)","v":"F"},null,"PosX",{"$f":"FIND(B3,E23)","v":1},{"$f":"Logik!G1","v":"C1"},"C1",false,"","F8E7D6C5B4A3","",false,"","F8","H6G7","","C1",0,{"$f":"IF(P4<>\"\",OFFSET(Logik!$D$4,0,ROW()-1),0)","v":0}]
["PosY:",{"$f":"RIGHT(B3,1)","v":"8"},null,"PosY",{"$f":"IFERROR(FIND(B3,E24),0)","v":5},{"$f":"Logik!H1","v":"D1"},"D1",false,"","F8E7D6C5B4A3","",false,"","F8","H6G7","","D1",0,{"$f":"IF(P5<>\"\",OFFSET(Logik!$D$4,0,ROW()-1),0)","v":0}]
[null,null,null,"RA",{"$f":"K33&J33","v":"F8E7"},{"$f":"Logik!I1","v":"E1"},"E1",false,"","F8E7D6C5B4A3","",false,"","F8","H6G7","","E1",0,{"$f":"IF(P6<>\"\",OFFSET(Logik!$D$4,0,ROW()-1),0)","v":0}]
["Poäng",{"$f":"Logik!AH3","v":300},null,"RB",{"$f":"O33&N33","v":"G7F8"},{"$f":"Logik!J1","v":"F1"},"F1",false,"","F8E7D6C5B4A3","",false,"","F8","H6G7","","F1",0,{"$f":"IF(P7<>\"\",OFFSET(Logik!$D$4,0,ROW()-1),0)","v":0}]
["PosPoäng",{"$f":"Logik!AH4","v":10},null,"RAB",{"$f":"E6&E7","v":"F8E7G7F8"},{"$f":"Logik!K1","v":"G1"},"G1",false,"","F8E7D6C5B4A3","",false,"","F8","H6G7","","G1",0,{"$f":"IF(P8<>\"\",OFFSET(Logik!$D$4,0,ROW()-1),0)","v":0}]
[null,null,null,"Försvar",{"$f":"SUM(R18:R33)+SUM(S18:S33)","v":200},{"$f":"Logik!L1","v":"H1"},"H1",false,"","F8E7D6C5B4A3","",false,"","F8","H6G7","","H1",0,{"$f":"IF(P9<>\"\",OFFSET(Logik!$D$4,0,ROW()-1),0)","v":0}]
[null,null,null,"Attack",{"$f":"SUM(R2:R17)+SUM(S2:S17)","v":0},{"$f":"Logik!M1","v":"A2"},"A2",false,"","F8E7D6C5B4A3","",false,"","F8","H6G7","","A2",0,{"$f":"IF(P10<>\"\",OFFSET(Logik!$D$4,0,ROW()-1),0)","v":0}]
[null,null,null,"R Antal",{"$f":"LEN(E8)/2","v":4},{"$f":"Logik!N1","v":"B2"},"B2",false,"","F8E7D6C5B4A3","",false,"","F8","H6G7","","B2",0,{"$f":"IF(P11<>\"\",OFFSET(Logik!$D$4,0,ROW()-1),0)","v":0}]
[null,null,null,null,null,{"$f":"Logik!O1","v":"C2"},"C2",false,"","F8E7D6C5B4A3","",false,"","F8","H6G7","","C2",0,{"$f":"IF(P12<>\"\",OFFSET(Logik!$D$4,0,ROW()-1),0)","v":0}]
[null,null,null,"FRvA",{"$f":"IFERROR(INDEX(tblRVL,MATCH(\"VL\"&$B$3,RVL!$A$2:$A$129,0),5),\"\")","v":"F8E7D6C5B4A3"},{"$f":"Logik!P1","v":"D2"},"D2",false,"","F8E7D6C5B4A3","",false,"","F8","H6G7","","D2",0,{"$f":"IF(P13<>\"\",OFFSET(Logik!$D$4,0,ROW()-1),0)","v":0}]
[null,null,null,"FRvB",{"$f":"IFERROR(INDEX(tblRVL,MATCH(\"VL\"&$B$3,RVL!$A$2:$A$129,0),6),\"\")","v":"F8"},{"$f":"Logik!Q1","v":"E2"},"E2",false,"","F8E7D6C5B4A3","",false,"","F8","H6G7","","E2",0,{"$f":"IF(P14<>\"\",OFFSET(Logik!$D$4,0,ROW()-1),0)","v":0}]
[null,null,null,"FRvC",{"$f":"IFERROR(INDEX(tblRVL,MATCH(\"VL\"&$B$3,RVL!$A$2:$A$129,0),7),\"\")","v":"H6G7"},{"$f":"Logik!R1","v":"F2"},"F2",false,"","F8E7D6C5B4A3","",false,"","F8","H6G7","","F2",0,{"$f":"IF(P15<>\"\",OFFSET(Logik!$D$4,0,ROW()-1),0)","v":0}]
[null,null,null,"FRvD",{"$f":"IFERROR(INDEX(tblRVL,MATCH(\"VL\"&$B$3,RVL!$A$2:$A$129,0),8),\"\")","v":""},{"$f":"Logik!S1","v":"G2"},"G2",false,"","F8E7D6C5B4A3","",false,"","F8","H6G7","","G2",0,{"$f":"IF(P16<>\"\",OFFSET(Logik!$D$4,0,ROW()-1),0)","v":0}]
[null,null,null,null,null,{"$f":"Logik!T1","v":"H2"},"H2",false,"","F8E7D6C5B4A3","",false,"","F8","H6G7","","H2",0,{"$f":"IF(P17<>\"\",OFFSET(Logik!$D$4,0,ROW()-1),0)","v":0},"MöjligaDrag"]
[null,null,null,"ARvA",{"$f":"IFERROR(INDEX(tblRVL,MATCH(\"VL\"&$B$3,RVL!$A$2:$A$129,0),9),\"\")","v":"E7D6C5B4A3"},{"$f":"Logik!U1","v":"A7"},"A7",false,"","F8E7D6C5B4A3","",false,"","F8","H6G7","","A7",{"$f":"IF(P18<>\"\",HLOOKUP(HLOOKUP(Q18,PjasStart,2,FALSE),Pjaser,4,FALSE),0)","v":0},{"$f":"IF(P18<>\"\",OFFSET(Logik!$D$4,0,ROW()-1),0)","v":0},{"$f":"SUBSTITUTE(E8,G18,\"\")","v":"F8E7G7F8"}]
[null,null,null,"ARvB",{"$f":"IFERROR(INDEX(tblRVL,MATCH(\"VL\"&$B$3,RVL!$A$2:$A$129,0),10),\"\")","v":""},{"$f":"Logik!V1","v":"B7"},"B7",false,"","F8E7D6C5B4A3","",false,"","F8","H6G7","","B7",0,{"$f":"IF(P19<>\"\",OFFSET(Logik!$D$4,0,ROW()-1),0)","v":0},{"$f":"SUBSTITUTE(T18,G19,\"\")","v":"F8E7G7F8"}]
[null,null,null,"ARvC",{"$f":"IFERROR(INDEX(tblRVL,MATCH(\"VL\"&$B$3,RVL!$A$2:$A$129,0),11),\"\")","v":"H6G7"},{"$f":"Logik!W1","v":"C7"},"C7",false,"","F8E7D6C5B4A3","",false,"","F8","H6G7","","C7",0,{"$f":"IF(P20<>\"\",OFFSET(Logik!$D$4,0,ROW()-1),0)","v":0},{"$f":"SUBSTITUTE(T19,G20,\"\")","v":"F8E7G7F8"}]
[null,null,null,"ARvD",{"$f":"IFERROR(INDEX(tblRVL,MATCH(\"VL\"&$B$3,RVL!$A$2:$A$129,0),12),\"\")","v":""},{"$f":"Logik!X1","v":"D7"},"D7",false,"","F8E7D6C5B4A3","",false,"","F8","H6G7","","D7",0,{"$f":"IF(P21<>\"\",OFFSET(Logik!$D$4,0,ROW()-1),0)","v":0},"F8E7G7F8"]
[null,null,null,null,null,{"$f":"Logik!Y1","v":"E7"},"E7",true,3,"F8E7","",false,"","F8","H6G7",3,"E7",100,{"$f":"IF(P22<>\"\",OFFSET(Logik!$D$4,0,ROW()-1),0)","v":0},"F8G7F8"]
[null,null,null,"FR1",{"$f":"E16&E13","v":"F8E7D6C5B4A3"},{"$f":"Logik!Z1","v":"F7"},"F7",false,"","F8E7","",false,"","F8","H6G7","","F7",0,{"$f":"IF(P23<>\"\",OFFSET(Logik!$D$4,0,ROW()-1),0)","v":0},"F8G7F8"]
[null,null,null,"FR2",{"$f":"E15&E14","v":"H6G7F8"},{"$f":"Logik!AA1","v":"G7"},"G7",false,"","F8E7","",true,3,"F8","G7",5,"G7",100,{"$f":"IF(P24<>\"\",OFFSET(Logik!$D$4,0,ROW()-1),0)","v":0},"F8F8"]
[null,null,null,null,null,{"$f":"Logik!AB1","v":"H7"},"H7",false,"","F8E7","",false,"","F8","G7","","H7",0,{"$f":"IF(P25<>\"\",OFFSET(Logik!$D$4,0,ROW()-1),0)","v":0},"F8F8"]
[null,null,null,"MöjligaDrag",{"$f":"T33","v":""},{"$f":"Logik!AC1","v":"A8"},"A8",false,"","F8E7","",false,"","F8","G7","","A8",0,{"$f":"IF(P26<>\"\",OFFSET(Logik!$D$4,0,ROW()-1),0)","v":0},"F8F8"]
[null,null,null,"D Antal",{"$f":"LEN(E26)/2","v":0},{"$f":"Logik!AD1","v":"B8"},"B8",false,"","F8E7","",false,"","F8","G7","","B8",0,{"$f":"IF(P27<>\"\",OFFSET(Logik!$D$4,0,ROW()-1),0)","v":0},"F8F8"]
[null,null,null,null,null,{"$f":"Logik!AE1","v":"C8"},"C8",false,"","F8E7","",false,"","F8","G7","","C8",0,{"$f":"IF(P28<>\"\",OFFSET(Logik!$D$4,0,ROW()-1),0)","v":0},"F8F8"]
[null,null,null,null,null,{"$f":"Logik!AF1","v":"D8"},"D8",false,"","F8E7","",false,"","F8","G7","","D8",0,{"$f":"IF(P29<>\"\",OFFSET(Logik!$D$4,0,ROW()-1),0)","v":0},"F8F8"]
[null,null,null,null,null,{"$f":"Logik!AG1","v":"E8"},"E8",false,"","F8E7","",false,"","F8","G7","","E8",0,{"$f":"IF(P30<>\"\",OFFSET(Logik!$D$4,0,ROW()-1),0)","v":0},"F8F8"]
[null,null,null,null,null,{"$f":"Logik!AH1","v":"F8"},"F8",false,"","F8E7","",false,"","F8","G7","","F8",0,{"$f":"IF(P31<>\"\",OFFSET(Logik!$D$4,0,ROW()-1),0)","v":0},""]
[null,null,null,null,null,{"$f":"Logik!AI1","v":"G8"},"G8",false,"","F8E7","",false,"","F8","G7","","G8",0,{"$f":"IF(P32<>\"\",OFFSET(Logik!$D$4,0,ROW()-1),0)","v":0},""]
[null,null,null,null,null,{"$f":"Logik!AJ1","v":"H8"},"H8",false,"","F8E7","",false,"","F8","G7","","H8",0,{"$f":"IF(P33<>\"\",OFFSET(Logik!$D$4,0,ROW()-1),0)","v":0},""]

{"sheet":"P_G8","index":27,"n_rows":33,"n_cols":20,"rows_kept":33,"cut":false,"hidden":true,"merged":[]}
[null,null,null,null,null,{"$f":"Logik!D1","v":"Pos:"},"Pjäs:","RäckviddX","Pos",{"$f":"SUBSTITUTE(E2,B3,\"\")","v":"F6H6E7"},{"$f":"LEFT($E$2,$E$4-1)","v":""},null,null,null,null,"Nåbar","Vad","Poäng","PosPoäng"]
["Pjäs:",{"$f":"Logik!AI2","v":"G8"},null,"RäckviddX",{"$f":"IFERROR(INDEX(tblRVS,MATCH(\"VS\"&$B$3,RVS!$A$2:$A$120,0),5),\"\")","v":"G8F6H6E7"},{"$f":"UPPER(Logik!E1)","v":"A1"},{"$f":"UPPER(F2)","v":"A1"},{"$f":"IF($G2<>\"\",IF($G2<>$B$3,IF(IFERROR(FIND($G2,$E$2)>0,FALSE),TRUE,FALSE),FALSE),FALSE)","v":false},{"$f":"IF(H2,FIND($G2,$E$2),\"\")","v":""},{"$f":"J1","v":"F6H6E7"},{"$f":"IF(AND($G2<>\"\",$G2>0,$I2<$E$4),RIGHT(K1,MIN($E$4-$I2,LEN(K1))),K1)","v":""},null,null,null,null,{"$f":"IFERROR(IF(AND(G2<>\"\",$G2<>$B$3),FIND(G2,$E$6),\"\"),\"\")","v":""},"A1",{"$f":"IF(P2<>\"\",HLOOKUP(HLOOKUP(Q2,PjasStart,2,FALSE),Pjaser,3,FALSE),0)","v":0},{"$f":"IF(P2<>\"\",OFFSET(Logik!$D$4,0,ROW()-1),0)","v":0}]
["Pos:",{"$f":"UPPER(Logik!AI1)","v":"G8"},null,null,null,{"$f":"Logik!F1","v":"B1"},{"$f":"UPPER(F3)","v":"B1"},{"$f":"IF($G3<>\"\",IF($G3<>$B$3,IF(IFERROR(FIND($G3,$E$2)>0,FALSE),TRUE,FALSE),FALSE),FALSE)","v":false},{"$f":"IF(H3,FIND($G3,$E$2),\"\")","v":""},{"$f":"J2","v":"F6H6E7"},{"$f":"IF(AND($G3<>\"\",$G3>0,$I3<$E$4),RIGHT(K2,MIN($E$4-$I3,LEN(K2))),K2)","v":""},null,null,null,null,{"$f":"IFERROR(IF(AND(G3<>\"\",$G3<>$B$3),FIND(G3,$E$6),\"\"),\"\")","v":""},"B1",0,{"$f":"IF(P3<>\"\",OFFSET(Logik!$D$4,0,ROW()-1),0)","v":0}]
["PosX:",{"$f":"LEFT(B3,1)","v":"G"},null,"PosX",{"$f":"FIND(B3,E2)","v":1},{"$f":"Logik!G1","v":"C1"},"C1",false,"","F6H6E7","",null,null,null,null,"","C1",0,{"$f":"IF(P4<>\"\",OFFSET(Logik!$D$4,0,ROW()-1),0)","v":0}]
["PosY:",{"$f":"RIGHT(B3,1)","v":"8"},null,null,null,{"$f":"Logik!H1","v":"D1"},"D1",false,"","F6H6E7","",null,null,null,null,"","D1",0,{"$f":"IF(P5<>\"\",OFFSET(Logik!$D$4,0,ROW()-1),0)","v":0}]
[null,null,null,"RX",{"$f":"K33&J33","v":"F6H6E7"},{"$f":"Logik!I1","v":"E1"},"E1",false,"","F6H6E7","",null,null,null,null,"","E1",0,{"$f":"IF(P6<>\"\",OFFSET(Logik!$D$4,0,ROW()-1),0)","v":0}]
["Poäng",{"$f":"Logik!AI3","v":300},null,null,null,{"$f":"Logik!J1","v":"F1"},"F1",false,"","F6H6E7","",null,null,null,null,"","F1",0,{"$f":"IF(P7<>\"\",OFFSET(Logik!$D$4,0,ROW()-1),0)","v":0}]
["PosPoäng",{"$f":"Logik!AI4","v":8},null,null,null,{"$f":"Logik!K1","v":"G1"},"G1",false,"","F6H6E7","",null,null,null,null,"","G1",0,{"$f":"IF(P8<>\"\",OFFSET(Logik!$D$4,0,ROW()-1),0)","v":0}]
[null,null,null,"Försvar",{"$f":"SUM(R18:R33)+SUM(S18:S33)","v":100},{"$f":"Logik!L1","v":"H1"},"H1",false,"","F6H6E7","",null,null,null,null,"","H1",0,{"$f":"IF(P9<>\"\",OFFSET(Logik!$D$4,0,ROW()-1),0)","v":0}]
[null,null,null,"Attack",{"$f":"SUM(R2:R17)+SUM(S2:S17)","v":0},{"$f":"Logik!M1","v":"A2"},"A2",false,"","F6H6E7","",null,null,null,null,"","A2",0,{"$f":"IF(P10<>\"\",OFFSET(Logik!$D$4,0,ROW()-1),0)","v":0}]
[null,null,null,"R Antal",{"$f":"LEN(E6)/2","v":3},{"$f":"Logik!N1","v":"B2"},"B2",false,"","F6H6E7","",null,null,null,null,"","B2",0,{"$f":"IF(P11<>\"\",OFFSET(Logik!$D$4,0,ROW()-1),0)","v":0}]
[null,null,null,null,null,{"$f":"Logik!O1","v":"C2"},"C2",false,"","F6H6E7","",null,null,null,null,"","C2",0,{"$f":"IF(P12<>\"\",OFFSET(Logik!$D$4,0,ROW()-1),0)","v":0}]
[null,null,null,"MöjligaDrag",{"$f":"T33","v":"F6H6"},{"$f":"Logik!P1","v":"D2"},"D2",false,"","F6H6E7","",null,null,null,null,"","D2",0,{"$f":"IF(P13<>\"\",OFFSET(Logik!$D$4,0,ROW()-1),0)","v":0}]
[null,null,null,"D Antal",{"$f":"LEN(E13)/2","v":2},{"$f":"Logik!Q1","v":"E2"},"E2",false,"","F6H6E7","",null,null,null,null,"","E2",0,{"$f":"IF(P14<>\"\",OFFSET(Logik!$D$4,0,ROW()-1),0)","v":0}]
[null,null,null,null,null,{"$f":"Logik!R1","v":"F2"},"F2",false,"","F6H6E7","",null,null,null,null,"","F2",0,{"$f":"IF(P15<>\"\",OFFSET(Logik!$D$4,0,ROW()-1),0)","v":0}]
[null,null,null,null,null,{"$f":"Logik!S1","v":"G2"},"G2",false,"","F6H6E7","",null,null,null,null,"","G2",0,{"$f":"IF(P16<>\"\",OFFSET(Logik!$D$4,0,ROW()-1),0)","v":0}]
[null,null,null,null,null,{"$f":"Logik!T1","v":"H2"},"H2",false,"","F6H6E7","",null,null,null,null,"","H2",0,{"$f":"IF(P17<>\"\",OFFSET(Logik!$D$4,0,ROW()-1),0)","v":0},"MöjligaDrag"]
[null,null,null,null,null,{"$f":"Logik!U1","v":"A7"},"A7",false,"","F6H6E7","",null,null,null,null,"","A7",{"$f":"IF(P18<>\"\",HLOOKUP(HLOOKUP(Q18,PjasStart,2,FALSE),Pjaser,4,FALSE),0)","v":0},{"$f":"IF(P18<>\"\",OFFSET(Logik!$D$4,0,ROW()-1),0)","v":0},{"$f":"SUBSTITUTE(E6,G18,\"\")","v":"F6H6E7"}]
[null,null,null,null,null,{"$f":"Logik!V1","v":"B7"},"B7",false,"","F6H6E7","",null,null,null,null,"","B7",0,{"$f":"IF(P19<>\"\",OFFSET(Logik!$D$4,0,ROW()-1),0)","v":0},{"$f":"SUBSTITUTE(T18,G19,\"\")","v":"F6H6E7"}]
[null,null,null,null,null,{"$f":"Logik!W1","v":"C7"},"C7",false,"","F6H6E7","",null,null,null,null,"","C7",0,{"$f":"IF(P20<>\"\",OFFSET(Logik!$D$4,0,ROW()-1),0)","v":0},{"$f":"SUBSTITUTE(T19,G20,\"\")","v":"F6H6E7"}]
[null,null,null,null,null,{"$f":"Logik!X1","v":"D7"},"D7",false,"","F6H6E7","",null,null,null,null,"","D7",0,{"$f":"IF(P21<>\"\",OFFSET(Logik!$D$4,0,ROW()-1),0)","v":0},"F6H6E7"]
[null,null,null,null,null,{"$f":"Logik!Y1","v":"E7"},"E7",true,7,"F6H6E7","",null,null,null,null,5,"E7",100,{"$f":"IF(P22<>\"\",OFFSET(Logik!$D$4,0,ROW()-1),0)","v":0},"F6H6"]
[null,null,null,null,null,{"$f":"Logik!Z1","v":"F7"},"F7",false,"","F6H6E7","",null,null,null,null,"","F7",0,{"$f":"IF(P23<>\"\",OFFSET(Logik!$D$4,0,ROW()-1),0)","v":0},"F6H6"]
[null,null,null,null,null,{"$f":"Logik!AA1","v":"G7"},"G7",false,"","F6H6E7","",null,null,null,null,"","G7",0,{"$f":"IF(P24<>\"\",OFFSET(Logik!$D$4,0,ROW()-1),0)","v":0},"F6H6"]
[null,null,null,null,null,{"$f":"Logik!AB1","v":"H7"},"H7",false,"","F6H6E7","",null,null,null,null,"","H7",0,{"$f":"IF(P25<>\"\",OFFSET(Logik!$D$4,0,ROW()-1),0)","v":0},"F6H6"]
[null,null,null,null,null,{"$f":"Logik!AC1","v":"A8"},"A8",false,"","F6H6E7","",null,null,null,null,"","A8",0,{"$f":"IF(P26<>\"\",OFFSET(Logik!$D$4,0,ROW()-1),0)","v":0},"F6H6"]
[null,null,null,null,null,{"$f":"Logik!AD1","v":"B8"},"B8",false,"","F6H6E7","",null,null,null,null,"","B8",0,{"$f":"IF(P27<>\"\",OFFSET(Logik!$D$4,0,ROW()-1),0)","v":0},"F6H6"]
[null,null,null,null,null,{"$f":"Logik!AE1","v":"C8"},"C8",false,"","F6H6E7","",null,null,null,null,"","C8",0,{"$f":"IF(P28<>\"\",OFFSET(Logik!$D$4,0,ROW()-1),0)","v":0},"F6H6"]
[null,null,null,null,null,{"$f":"Logik!AF1","v":"D8"},"D8",false,"","F6H6E7","",null,null,null,null,"","D8",0,{"$f":"IF(P29<>\"\",OFFSET(Logik!$D$4,0,ROW()-1),0)","v":0},"F6H6"]
[null,null,null,null,null,{"$f":"Logik!AG1","v":"E8"},"E8",false,"","F6H6E7","",null,null,null,null,"","E8",0,{"$f":"IF(P30<>\"\",OFFSET(Logik!$D$4,0,ROW()-1),0)","v":0},"F6H6"]
[null,null,null,null,null,{"$f":"Logik!AH1","v":"F8"},"F8",false,"","F6H6E7","",null,null,null,null,"","F8",0,{"$f":"IF(P31<>\"\",OFFSET(Logik!$D$4,0,ROW()-1),0)","v":0},"F6H6"]
[null,null,null,null,null,{"$f":"Logik!AI1","v":"G8"},"G8",false,"","F6H6E7","",null,null,null,null,"","G8",0,{"$f":"IF(P32<>\"\",OFFSET(Logik!$D$4,0,ROW()-1),0)","v":0},"F6H6"]
[null,null,null,null,null,{"$f":"Logik!AJ1","v":"H8"},"H8",false,"","F6H6E7","",null,null,null,null,"","H8",0,{"$f":"IF(P33<>\"\",OFFSET(Logik!$D$4,0,ROW()-1),0)","v":0},"F6H6"]

{"sheet":"P_H8","index":28,"n_rows":33,"n_cols":20,"rows_kept":33,"cut":false,"hidden":true,"merged":[]}
[null,null,null,null,null,{"$f":"Logik!D1","v":"Pos:"},"Pjäs:","RäckviddX","Pos",{"$f":"RIGHT($E$2,LEN($E$2)-$E$4+1)","v":"H8"},{"$f":"LEFT($E$2,$E$4-1)","v":"A8B8C8D8E8F8G8"},"RäckviddY",null,{"$f":"RIGHT($E$3,LEN($E$3)-$E$5+1)","v":"H8"},{"$f":"LEFT($E$3,$E$5-1)","v":"H1H2H3H4H5H6H7"},"Nåbar","Vad","Poäng","PosPoäng"]
["Pjäs:",{"$f":"Logik!AJ2","v":"H8"},null,"RäckviddX",{"$f":"IF($B$3<>\"\",\"A\"&B5&\"B\"&B5&\"C\"&B5&\"D\"&B5&\"E\"&B5&\"F\"&B5&\"G\"&B5&\"H\"&B5,\"\")","v":"A8B8C8D8E8F8G8H8"},{"$f":"UPPER(Logik!E1)","v":"A1"},{"$f":"UPPER(F2)","v":"A1"},{"$f":"IF($G2<>\"\",IF($G2<>$B$3,IF(IFERROR(FIND($G2,$E$2)>0,FALSE),TRUE,FALSE),FALSE),FALSE)","v":false},{"$f":"IF(H2,FIND($G2,$E$2),\"\")","v":""},{"$f":"IF(AND(I2<>\"\",I2>0,I2>$E$4),LEFT(J1,MIN(I2-$E$4+2,LEN(J1))),J1)","v":"H8"},{"$f":"IF(AND($G2<>\"\",$G2>0,$I2<$E$4),RIGHT(K1,MIN($E$4-$I2,LEN(K1))),K1)","v":"A8B8C8D8E8F8G8"},{"$f":"IF($G2<>\"\",IF($G2<>$B$3,IF(IFERROR(FIND($G2,$E$3)>0,FALSE),TRUE,FALSE),FALSE),FALSE)","v":false},{"$f":"IF(L2,FIND($G2,$E$3),\"\")","v":""},{"$f":"IF(AND(M2<>\"\",M2>0,M2>$E$5),LEFT(N1,MIN(M2-$E$5+2,LEN(N1))),N1)","v":"H8"},{"$f":"IF(AND($G2<>\"\",$G2>0,M2<$E$5),RIGHT(O1,MIN($E$5-M2,LEN(O1))),O1)","v":"H1H2H3H4H5H6H7"},{"$f":"IFERROR(IF(AND(G2<>\"\",$G2<>$B$3),FIND(G2,$E$8),\"\"),\"\")","v":""},"A1",{"$f":"IF(P2<>\"\",HLOOKUP(HLOOKUP(Q2,PjasStart,2,FALSE),Pjaser,3,FALSE),0)","v":0},{"$f":"IF(P2<>\"\",OFFSET(Logik!$D$4,0,ROW()-1),0)","v":0}]
["Pos:",{"$f":"UPPER(Logik!AJ1)","v":"H8"},null,"RäckviddY",{"$f":"IF($B$3<>\"\",B4&\"1\"&B4&\"2\"&B4&\"3\"&B4&\"4\"&B4&\"5\"&B4&\"6\"&B4&\"7\"&B4&\"8\",\"\")","v":"H1H2H3H4H5H6H7H8"},{"$f":"Logik!F1","v":"B1"},{"$f":"UPPER(F3)","v":"B1"},{"$f":"IF($G3<>\"\",IF($G3<>$B$3,IF(IFERROR(FIND($G3,$E$2)>0,FALSE),TRUE,FALSE),FALSE),FALSE)","v":false},{"$f":"IF(H3,FIND($G3,$E$2),\"\")","v":""},{"$f":"IF(AND(I3<>\"\",I3>0,I3>$E$4),LEFT(J2,MIN(I3-$E$4+2,LEN(J2))),J2)","v":"H8"},{"$f":"IF(AND($G3<>\"\",$G3>0,$I3<$E$4),RIGHT(K2,MIN($E$4-$I3,LEN(K2))),K2)","v":"A8B8C8D8E8F8G8"},{"$f":"IF($G3<>\"\",IF($G3<>$B$3,IF(IFERROR(FIND($G3,$E$3)>0,FALSE),TRUE,FALSE),FALSE),FALSE)","v":false},{"$f":"IF(L3,FIND($G3,$E$3),\"\")","v":""},{"$f":"IF(AND(M3<>\"\",M3>0,M3>$E$5),LEFT(N2,MIN(M3-$E$5+2,LEN(N2))),N2)","v":"H8"},{"$f":"IF(AND($G3<>\"\",$G3>0,M3<$E$5),RIGHT(O2,MIN($E$5-M3,LEN(O2))),O2)","v":"H1H2H3H4H5H6H7"},{"$f":"IFERROR(IF(AND(G3<>\"\",$G3<>$B$3),FIND(G3,$E$8),\"\"),\"\")","v":""},"B1",0,{"$f":"IF(P3<>\"\",OFFSET(Logik!$D$4,0,ROW()-1),0)","v":0}]
["PosX:",{"$f":"LEFT(B3,1)","v":"H"},null,"PosX",{"$f":"FIND(B3,E2)","v":15},{"$f":"Logik!G1","v":"C1"},"C1",false,"","H8","A8B8C8D8E8F8G8",false,"","H8","H1H2H3H4H5H6H7","","C1",0,{"$f":"IF(P4<>\"\",OFFSET(Logik!$D$4,0,ROW()-1),0)","v":0}]
["PosY:",{"$f":"RIGHT(B3,1)","v":"8"},null,"PosY",{"$f":"FIND(B3,E3)","v":15},{"$f":"Logik!H1","v":"D1"},"D1",false,"","H8","A8B8C8D8E8F8G8",false,"","H8","H1H2H3H4H5H6H7","","D1",0,{"$f":"IF(P5<>\"\",OFFSET(Logik!$D$4,0,ROW()-1),0)","v":0}]
[null,null,null,"RX",{"$f":"K33&J33","v":"G8H8"},{"$f":"Logik!I1","v":"E1"},"E1",false,"","H8","A8B8C8D8E8F8G8",false,"","H8","H1H2H3H4H5H6H7","","E1",0,{"$f":"IF(P6<>\"\",OFFSET(Logik!$D$4,0,ROW()-1),0)","v":0}]
["Poäng",{"$f":"Logik!AJ3","v":500},null,"RY",{"$f":"O33&N33","v":"H7H8"},{"$f":"Logik!J1","v":"F1"},"F1",false,"","H8","A8B8C8D8E8F8G8",false,"","H8","H1H2H3H4H5H6H7","","F1",0,{"$f":"IF(P7<>\"\",OFFSET(Logik!$D$4,0,ROW()-1),0)","v":0}]
["PosPoäng",{"$f":"Logik!AJ4","v":6},null,"RXY",{"$f":"E6&E7","v":"G8H8H7H8"},{"$f":"Logik!K1","v":"G1"},"G1",false,"","H8","A8B8C8D8E8F8G8",false,"","H8","H1H2H3H4H5H6H7","","G1",0,{"$f":"IF(P8<>\"\",OFFSET(Logik!$D$4,0,ROW()-1),0)","v":0}]
[null,null,null,"Försvar",{"$f":"SUM(R18:R33)+SUM(S18:S33)","v":408},{"$f":"Logik!L1","v":"H1"},"H1",false,"","H8","A8B8C8D8E8F8G8",true,1,"H8","H1H2H3H4H5H6H7","","H1",0,{"$f":"IF(P9<>\"\",OFFSET(Logik!$D$4,0,ROW()-1),0)","v":0}]
[null,null,null,"Attack",{"$f":"SUM(R2:R17)+SUM(S2:S17)","v":0},{"$f":"Logik!M1","v":"A2"},"A2",false,"","H8","A8B8C8D8E8F8G8",false,"","H8","H1H2H3H4H5H6H7","","A2",0,{"$f":"IF(P10<>\"\",OFFSET(Logik!$D$4,0,ROW()-1),0)","v":0}]
[null,null,null,"R Antal",{"$f":"LEN(E8)/2","v":4},{"$f":"Logik!N1","v":"B2"},"B2",false,"","H8","A8B8C8D8E8F8G8",false,"","H8","H1H2H3H4H5H6H7","","B2",0,{"$f":"IF(P11<>\"\",OFFSET(Logik!$D$4,0,ROW()-1),0)","v":0}]
[null,null,null,null,null,{"$f":"Logik!O1","v":"C2"},"C2",false,"","H8","A8B8C8D8E8F8G8",false,"","H8","H1H2H3H4H5H6H7","","C2",0,{"$f":"IF(P12<>\"\",OFFSET(Logik!$D$4,0,ROW()-1),0)","v":0}]
[null,null,null,"MöjligaDrag",{"$f":"T33","v":""},{"$f":"Logik!P1","v":"D2"},"D2",false,"","H8","A8B8C8D8E8F8G8",false,"","H8","H1H2H3H4H5H6H7","","D2",0,{"$f":"IF(P13<>\"\",OFFSET(Logik!$D$4,0,ROW()-1),0)","v":0}]
[null,null,null,"D Antal",{"$f":"LEN(E13)/2","v":0},{"$f":"Logik!Q1","v":"E2"},"E2",false,"","H8","A8B8C8D8E8F8G8",false,"","H8","H1H2H3H4H5H6H7","","E2",0,{"$f":"IF(P14<>\"\",OFFSET(Logik!$D$4,0,ROW()-1),0)","v":0}]
[null,null,null,null,null,{"$f":"Logik!R1","v":"F2"},"F2",false,"","H8","A8B8C8D8E8F8G8",false,"","H8","H1H2H3H4H5H6H7","","F2",0,{"$f":"IF(P15<>\"\",OFFSET(Logik!$D$4,0,ROW()-1),0)","v":0}]
[null,null,null,null,null,{"$f":"Logik!S1","v":"G2"},"G2",false,"","H8","A8B8C8D8E8F8G8",false,"","H8","H1H2H3H4H5H6H7","","G2",0,{"$f":"IF(P16<>\"\",OFFSET(Logik!$D$4,0,ROW()-1),0)","v":0}]
[null,null,null,null,null,{"$f":"Logik!T1","v":"H2"},"H2",false,"","H8","A8B8C8D8E8F8G8",true,3,"H8","H2H3H4H5H6H7","","H2",0,{"$f":"IF(P17<>\"\",OFFSET(Logik!$D$4,0,ROW()-1),0)","v":0},"MöjligaDrag"]
[null,null,null,null,null,{"$f":"Logik!U1","v":"A7"},"A7",false,"","H8","A8B8C8D8E8F8G8",false,"","H8","H2H3H4H5H6H7","","A7",{"$f":"IF(P18<>\"\",HLOOKUP(HLOOKUP(Q18,PjasStart,2,FALSE),Pjaser,4,FALSE),0)","v":0},{"$f":"IF(P18<>\"\",OFFSET(Logik!$D$4,0,ROW()-1),0)","v":0},{"$f":"SUBSTITUTE(E8,G18,\"\")","v":"G8H8H7H8"}]
[null,null,null,null,null,{"$f":"Logik!V1","v":"B7"},"B7",false,"","H8","A8B8C8D8E8F8G8",false,"","H8","H2H3H4H5H6H7","","B7",0,{"$f":"IF(P19<>\"\",OFFSET(Logik!$D$4,0,ROW()-1),0)","v":0},{"$f":"SUBSTITUTE(T18,G19,\"\")","v":"G8H8H7H8"}]
[null,null,null,null,null,{"$f":"Logik!W1","v":"C7"},"C7",false,"","H8","A8B8C8D8E8F8G8",false,"","H8","H2H3H4H5H6H7","","C7",0,{"$f":"IF(P20<>\"\",OFFSET(Logik!$D$4,0,ROW()-1),0)","v":0},{"$f":"SUBSTITUTE(T19,G20,\"\")","v":"G8H8H7H8"}]
[null,null,null,null,null,{"$f":"Logik!X1","v":"D7"},"D7",false,"","H8","A8B8C8D8E8F8G8",false,"","H8","H2H3H4H5H6H7","","D7",0,{"$f":"IF(P21<>\"\",OFFSET(Logik!$D$4,0,ROW()-1),0)","v":0},"G8H8H7H8"]
[null,null,null,null,null,{"$f":"Logik!Y1","v":"E7"},"E7",false,"","H8","A8B8C8D8E8F8G8",false,"","H8","H2H3H4H5H6H7","","E7",0,{"$f":"IF(P22<>\"\",OFFSET(Logik!$D$4,0,ROW()-1),0)","v":0},"G8H8H7H8"]
[null,null,null,null,null,{"$f":"Logik!Z1","v":"F7"},"F7",false,"","H8","A8B8C8D8E8F8G8",false,"","H8","H2H3H4H5H6H7","","F7",0,{"$f":"IF(P23<>\"\",OFFSET(Logik!$D$4,0,ROW()-1),0)","v":0},"G8H8H7H8"]
[null,null,null,null,null,{"$f":"Logik!AA1","v":"G7"},"G7",false,"","H8","A8B8C8D8E8F8G8",false,"","H8","H2H3H4H5H6H7","","G7",0,{"$f":"IF(P24<>\"\",OFFSET(Logik!$D$4,0,ROW()-1),0)","v":0},"G8H8H7H8"]
[null,null,null,null,null,{"$f":"Logik!AB1","v":"H7"},"H7",false,"","H8","A8B8C8D8E8F8G8",true,13,"H8","H7",5,"H7",100,{"$f":"IF(P25<>\"\",OFFSET(Logik!$D$4,0,ROW()-1),0)","v":0},"G8H8H8"]
[null,null,null,null,null,{"$f":"Logik!AC1","v":"A8"},"A8",true,1,"H8","A8B8C8D8E8F8G8",false,"","H8","H7","","A8",0,{"$f":"IF(P26<>\"\",OFFSET(Logik!$D$4,0,ROW()-1),0)","v":0},"G8H8H8"]
[null,null,null,null,null,{"$f":"Logik!AD1","v":"B8"},"B8",true,3,"H8","B8C8D8E8F8G8",false,"","H8","H7","","B8",0,{"$f":"IF(P27<>\"\",OFFSET(Logik!$D$4,0,ROW()-1),0)","v":0},"G8H8H8"]
[null,null,null,null,null,{"$f":"Logik!AE1","v":"C8"},"C8",true,5,"H8","C8D8E8F8G8",false,"","H8","H7","","C8",0,{"$f":"IF(P28<>\"\",OFFSET(Logik!$D$4,0,ROW()-1),0)","v":0},"G8H8H8"]
[null,null,null,null,null,{"$f":"Logik!AF1","v":"D8"},"D8",true,7,"H8","D8E8F8G8",false,"","H8","H7","","D8",0,{"$f":"IF(P29<>\"\",OFFSET(Logik!$D$4,0,ROW()-1),0)","v":0},"G8H8H8"]
[null,null,null,null,null,{"$f":"Logik!AG1","v":"E8"},"E8",true,9,"H8","E8F8G8",false,"","H8","H7","","E8",0,{"$f":"IF(P30<>\"\",OFFSET(Logik!$D$4,0,ROW()-1),0)","v":0},"G8H8H8"]
[null,null,null,null,null,{"$f":"Logik!AH1","v":"F8"},"F8",true,11,"H8","F8G8",false,"","H8","H7","","F8",0,{"$f":"IF(P31<>\"\",OFFSET(Logik!$D$4,0,ROW()-1),0)","v":0},"G8H8H8"]
[null,null,null,null,null,{"$f":"Logik!AI1","v":"G8"},"G8",true,13,"H8","G8",false,"","H8","H7",1,"G8",300,{"$f":"IF(P32<>\"\",OFFSET(Logik!$D$4,0,ROW()-1),0)","v":8},"H8H8"]
[null,null,null,null,null,{"$f":"Logik!AJ1","v":"H8"},"H8",false,"","H8","G8",false,"","H8","H7","","H8",0,{"$f":"IF(P33<>\"\",OFFSET(Logik!$D$4,0,ROW()-1),0)","v":0},""]

{"sheet":"P_A2","index":29,"n_rows":33,"n_cols":20,"rows_kept":33,"cut":false,"hidden":true,"merged":[]}
[null,null,null,null,null,{"$f":"Logik!D1","v":"Pos:"},"Pjäs:","Fräckvidd","Pos",{"$f":"RIGHT($E$2,LEN($E$2)-$E$4+1)","v":"A2A3A4"},{"$f":"LEFT($E$2,$E$4-1)","v":""},"Aräckvidd",null,{"$f":"RIGHT($E$3,LEN($E$3)-$E$5+1)","v":"B3"},{"$f":"IF(E5=0,\"\",(LEFT($E$3,$E$5-1)))","v":""},"Nåbar","Vad","Poäng","PosPoäng","MöjligaDrag"]
["Pjäs:",{"$f":"Logik!M2","v":"A2"},null,"FRäckvidd",{"$f":"IFERROR(INDEX(tblRVB,MATCH(\"VB\"&$B$3,RVB!$A$2:$A$120,0),5),\"\")","v":"A2A3A4"},{"$f":"UPPER(Logik!E1)","v":"A1"},{"$f":"UPPER(F2)","v":"A1"},{"$f":"IF($G2<>\"\",IF($G2<>$B$3,IF(IFERROR(FIND($G2,$E$2)>0,FALSE),TRUE,FALSE),FALSE),FALSE)","v":false},{"$f":"IF(H2,FIND($G2,$E$2),\"\")","v":""},{"$f":"IF(AND(I2<>\"\",I2>0,I2>$E$4),LEFT(J1,MIN(I2-$E$4+2,LEN(J1))),J1)","v":"A2A3A4"},{"$f":"IF(AND($G2<>\"\",$G2>0,$I2<$E$4),RIGHT(K1,MIN($E$4-$I2,LEN(K1))),K1)","v":""},{"$f":"IF($G2<>\"\",IF($G2<>$B$3,IF(IFERROR(FIND($G2,$E$3)>0,FALSE),TRUE,FALSE),FALSE),FALSE)","v":false},{"$f":"IF(L2,FIND($G2,$E$3),\"\")","v":""},{"$f":"IF(AND(M2<>\"\",M2>0,M2>$E$5),LEFT(N1,MIN(M2-$E$5+3,LEN(N1))),N1)","v":"B3"},{"$f":"IF(AND($G2<>\"\",$G2>0,M2<$E$5),RIGHT(O1,MIN($E$5-M2,LEN(O1))),O1)","v":""},{"$f":"IFERROR(IF(AND(G2<>\"\",$G2<>$B$3),FIND(G2,$E$7),\"\"),\"\")","v":""},"A1",{"$f":"IF(P2<>\"\",HLOOKUP(HLOOKUP(Q2,PjasStart,2,FALSE),Pjaser,4,FALSE),0)","v":0},{"$f":"IF(P2<>\"\",OFFSET(Logik!$D$4,0,ROW()-1),0)","v":0},{"$f":"SUBSTITUTE(E6,G2,\"\")","v":"A2A3A4"}]
["Pos:",{"$f":"UPPER(Logik!M1)","v":"A2"},null,"Aräckvidd",{"$f":"IFERROR(INDEX(tblRVB,MATCH(\"VB\"&$B$3,RVB!$A$2:$A$120,0),6),\"\")","v":"B3"},{"$f":"Logik!F1","v":"B1"},{"$f":"UPPER(F3)","v":"B1"},{"$f":"IF($G3<>\"\",IF($G3<>$B$3,IF(IFERROR(FIND($G3,$E$2)>0,FALSE),TRUE,FALSE),FALSE),FALSE)","v":false},{"$f":"IF(H3,FIND($G3,$E$2),\"\")","v":""},{"$f":"IF(AND(I3<>\"\",I3>0,I3>$E$4),LEFT(J2,MIN(I3-$E$4+2,LEN(J2))),J2)","v":"A2A3A4"},{"$f":"IF(AND($G3<>\"\",$G3>0,$I3<$E$4),RIGHT(K2,MIN($E$4-$I3,LEN(K2))),K2)","v":""},{"$f":"IF($G3<>\"\",IF($G3<>$B$3,IF(IFERROR(FIND($G3,$E$3)>0,FALSE),TRUE,FALSE),FALSE),FALSE)","v":false},{"$f":"IF(L3,FIND($G3,$E$3),\"\")","v":""},{"$f":"IF(AND(M3<>\"\",M3>0,M3>$E$5),LEFT(N2,MIN(M3-$E$5+3,LEN(N2))),N2)","v":"B3"},{"$f":"IF(AND($G3<>\"\",$G3>0,M3<$E$5),RIGHT(O2,MIN($E$5-M3,LEN(O2))),O2)","v":""},{"$f":"IFERROR(IF(AND(G3<>\"\",$G3<>$B$3),FIND(G3,$E$7),\"\"),\"\")","v":""},"B1",0,{"$f":"IF(P3<>\"\",OFFSET(Logik!$D$4,0,ROW()-1),0)","v":0},{"$f":"SUBSTITUTE(T2,G3,\"\")","v":"A2A3A4"}]
["PosX:",{"$f":"LEFT(B3,1)","v":"A"},null,"PosX",{"$f":"FIND(B3,E2)","v":1},{"$f":"Logik!G1","v":"C1"},"C1",false,"","A2A3A4","",false,"","B3","","","C1",0,{"$f":"IF(P4<>\"\",OFFSET(Logik!$D$4,0,ROW()-1),0)","v":0},{"$f":"SUBSTITUTE(T3,G4,\"\")","v":"A2A3A4"}]
["PosY:",{"$f":"RIGHT(B3,1)","v":"2"},null,"PosY",{"$f":"IFERROR(FIND(B3,E3),0)","v":0},{"$f":"Logik!H1","v":"D1"},"D1",false,"","A2A3A4","",false,"","B3","","","D1",0,{"$f":"IF(P5<>\"\",OFFSET(Logik!$D$4,0,ROW()-1),0)","v":0},"A2A3A4"]
[null,null,null,"RX",{"$f":"K33&J33","v":"A2A3A4"},{"$f":"Logik!I1","v":"E1"},"E1",false,"","A2A3A4","",false,"","B3","","","E1",0,{"$f":"IF(P6<>\"\",OFFSET(Logik!$D$4,0,ROW()-1),0)","v":0},"A2A3A4"]
["Poäng",{"$f":"Logik!M3","v":100},null,"RA",{"$f":"O33&N33","v":"B3"},{"$f":"Logik!J1","v":"F1"},"F1",false,"","A2A3A4","",false,"","B3","","","F1",0,{"$f":"IF(P7<>\"\",OFFSET(Logik!$D$4,0,ROW()-1),0)","v":0},"A2A3A4"]
["PosPoäng",{"$f":"Logik!M4","v":0},null,"RXY",{"$f":"E6&E7","v":"A2A3A4B3"},{"$f":"Logik!K1","v":"G1"},"G1",false,"","A2A3A4","",false,"","B3","","","G1",0,{"$f":"IF(P8<>\"\",OFFSET(Logik!$D$4,0,ROW()-1),0)","v":0},"A2A3A4"]
[null,null,null,"Försvar",{"$f":"SUM(R2:R17)+SUM(S2:S17)","v":0},{"$f":"Logik!L1","v":"H1"},"H1",false,"","A2A3A4","",false,"","B3","","","H1",0,{"$f":"IF(P9<>\"\",OFFSET(Logik!$D$4,0,ROW()-1),0)","v":0},"A2A3A4"]
[null,null,null,"Attack",{"$f":"SUM(R18:R33)+SUM(S18:S33)","v":0},{"$f":"Logik!M1","v":"A2"},"A2",false,"","A2A3A4","",false,"","B3","","","A2",0,{"$f":"IF(P10<>\"\",OFFSET(Logik!$D$4,0,ROW()-1),0)","v":0},"A3A4"]
[null,null,null,"R Antal",{"$f":"LEN(E8)/2","v":4},{"$f":"Logik!N1","v":"B2"},"B2",false,"","A2A3A4","",false,"","B3","","","B2",0,{"$f":"IF(P11<>\"\",OFFSET(Logik!$D$4,0,ROW()-1),0)","v":0},"A3A4"]
[null,null,null,null,null,{"$f":"Logik!O1","v":"C2"},"C2",false,"","A2A3A4","",false,"","B3","","","C2",0,{"$f":"IF(P12<>\"\",OFFSET(Logik!$D$4,0,ROW()-1),0)","v":0},"A3A4"]
[null,null,null,"MöjligaDrag",{"$f":"T33","v":"A3A4"},{"$f":"Logik!P1","v":"D2"},"D2",false,"","A2A3A4","",false,"","B3","","","D2",0,{"$f":"IF(P13<>\"\",OFFSET(Logik!$D$4,0,ROW()-1),0)","v":0},"A3A4"]
[null,null,null,"D Antal",{"$f":"LEN(E13)/2","v":2},{"$f":"Logik!Q1","v":"E2"},"E2",false,"","A2A3A4","",false,"","B3","","","E2",0,{"$f":"IF(P14<>\"\",OFFSET(Logik!$D$4,0,ROW()-1),0)","v":0},"A3A4"]
[null,null,null,null,null,{"$f":"Logik!R1","v":"F2"},"F2",false,"","A2A3A4","",false,"","B3","","","F2",0,{"$f":"IF(P15<>\"\",OFFSET(Logik!$D$4,0,ROW()-1),0)","v":0},"A3A4"]
[null,null,null,null,null,{"$f":"Logik!S1","v":"G2"},"G2",false,"","A2A3A4","",false,"","B3","","","G2",0,{"$f":"IF(P16<>\"\",OFFSET(Logik!$D$4,0,ROW()-1),0)","v":0},"A3A4"]
[null,null,null,null,null,{"$f":"Logik!T1","v":"H2"},"H2",false,"","A2A3A4","",false,"","B3","","","H2",0,{"$f":"IF(P17<>\"\",OFFSET(Logik!$D$4,0,ROW()-1),0)","v":0},"A3A4"]
[null,null,null,null,null,{"$f":"Logik!U1","v":"A7"},"A7",false,"","A2A3A4","",false,"","B3","","","A7",{"$f":"IF(P18<>\"\",HLOOKUP(HLOOKUP(Q18,PjasStart,2,FALSE),Pjaser,3,FALSE),0)","v":0},{"$f":"IF(P18<>\"\",OFFSET(Logik!$D$4,0,ROW()-1),0)","v":0},{"$f":"SUBSTITUTE(T17,G18,\"\")&IF(IFERROR(FIND(G18,N18)>0,FALSE),G18,\"\")","v":"A3A4"}]
[null,null,null,null,null,{"$f":"Logik!V1","v":"B7"},"B7",false,"","A2A3A4","",false,"","B3","","","B7",0,{"$f":"IF(P19<>\"\",OFFSET(Logik!$D$4,0,ROW()-1),0)","v":0},{"$f":"SUBSTITUTE(T18,G19,\"\")&IF(IFERROR(FIND(G19,N19)>0,FALSE),G19,\"\")","v":"A3A4"}]
[null,null,null,null,null,{"$f":"Logik!W1","v":"C7"},"C7",false,"","A2A3A4","",false,"","B3","","","C7",0,{"$f":"IF(P20<>\"\",OFFSET(Logik!$D$4,0,ROW()-1),0)","v":0},"A3A4"]
[null,null,null,null,null,{"$f":"Logik!X1","v":"D7"},"D7",false,"","A2A3A4","",false,"","B3","","","D7",0,{"$f":"IF(P21<>\"\",OFFSET(Logik!$D$4,0,ROW()-1),0)","v":0},"A3A4"]
[null,null,null,null,null,{"$f":"Logik!Y1","v":"E7"},"E7",false,"","A2A3A4","",false,"","B3","","","E7",0,{"$f":"IF(P22<>\"\",OFFSET(Logik!$D$4,0,ROW()-1),0)","v":0},"A3A4"]
[null,null,null,null,null,{"$f":"Logik!Z1","v":"F7"},"F7",false,"","A2A3A4","",false,"","B3","","","F7",0,{"$f":"IF(P23<>\"\",OFFSET(Logik!$D$4,0,ROW()-1),0)","v":0},"A3A4"]
[null,null,null,null,null,{"$f":"Logik!AA1","v":"G7"},"G7",false,"","A2A3A4","",false,"","B3","","","G7",0,{"$f":"IF(P24<>\"\",OFFSET(Logik!$D$4,0,ROW()-1),0)","v":0},"A3A4"]
[null,null,null,null,null,{"$f":"Logik!AB1","v":"H7"},"H7",false,"","A2A3A4","",false,"","B3","","","H7",0,{"$f":"IF(P25<>\"\",OFFSET(Logik!$D$4,0,ROW()-1),0)","v":0},"A3A4"]
[null,null,null,null,null,{"$f":"Logik!AC1","v":"A8"},"A8",false,"","A2A3A4","",false,"","B3","","","A8",0,{"$f":"IF(P26<>\"\",OFFSET(Logik!$D$4,0,ROW()-1),0)","v":0},"A3A4"]
[null,null,null,null,null,{"$f":"Logik!AD1","v":"B8"},"B8",false,"","A2A3A4","",false,"","B3","","","B8",0,{"$f":"IF(P27<>\"\",OFFSET(Logik!$D$4,0,ROW()-1),0)","v":0},"A3A4"]
[null,null,null,null,null,{"$f":"Logik!AE1","v":"C8"},"C8",false,"","A2A3A4","",false,"","B3","","","C8",0,{"$f":"IF(P28<>\"\",OFFSET(Logik!$D$4,0,ROW()-1),0)","v":0},"A3A4"]
[null,null,null,null,null,{"$f":"Logik!AF1","v":"D8"},"D8",false,"","A2A3A4","",false,"","B3","","","D8",0,{"$f":"IF(P29<>\"\",OFFSET(Logik!$D$4,0,ROW()-1),0)","v":0},"A3A4"]
[null,null,null,null,null,{"$f":"Logik!AG1","v":"E8"},"E8",false,"","A2A3A4","",false,"","B3","","","E8",0,{"$f":"IF(P30<>\"\",OFFSET(Logik!$D$4,0,ROW()-1),0)","v":0},"A3A4"]
[null,null,null,null,null,{"$f":"Logik!AH1","v":"F8"},"F8",false,"","A2A3A4","",false,"","B3","","","F8",0,{"$f":"IF(P31<>\"\",OFFSET(Logik!$D$4,0,ROW()-1),0)","v":0},"A3A4"]
[null,null,null,null,null,{"$f":"Logik!AI1","v":"G8"},"G8",false,"","A2A3A4","",false,"","B3","","","G8",0,{"$f":"IF(P32<>\"\",OFFSET(Logik!$D$4,0,ROW()-1),0)","v":0},"A3A4"]
[null,null,null,null,null,{"$f":"Logik!AJ1","v":"H8"},"H8",false,"","A2A3A4","",false,"","B3","","","H8",0,{"$f":"IF(P33<>\"\",OFFSET(Logik!$D$4,0,ROW()-1),0)","v":0},"A3A4"]

{"sheet":"P_B2","index":30,"n_rows":33,"n_cols":20,"rows_kept":33,"cut":false,"hidden":true,"merged":[]}
[null,null,null,null,null,{"$f":"Logik!D1","v":"Pos:"},"Pjäs:","Fräckvidd","Pos",{"$f":"RIGHT($E$2,LEN($E$2)-$E$4+1)","v":"B2B3B4"},{"$f":"LEFT($E$2,$E$4-1)","v":""},"Aräckvidd",null,{"$f":"RIGHT($E$3,LEN($E$3)-$E$5+1)","v":"A3C3"},{"$f":"IF(E5=0,\"\",(LEFT($E$3,$E$5-1)))","v":""},"Nåbar","Vad","Poäng","PosPoäng","MöjligaDrag"]
["Pjäs:",{"$f":"Logik!N2","v":"B2"},null,"FRäckvidd",{"$f":"IFERROR(INDEX(tblRVB,MATCH(\"VB\"&$B$3,RVB!$A$2:$A$120,0),5),\"\")","v":"B2B3B4"},{"$f":"UPPER(Logik!E1)","v":"A1"},{"$f":"UPPER(F2)","v":"A1"},{"$f":"IF($G2<>\"\",IF($G2<>$B$3,IF(IFERROR(FIND($G2,$E$2)>0,FALSE),TRUE,FALSE),FALSE),FALSE)","v":false},{"$f":"IF(H2,FIND($G2,$E$2),\"\")","v":""},{"$f":"IF(AND(I2<>\"\",I2>0,I2>$E$4),LEFT(J1,MIN(I2-$E$4+2,LEN(J1))),J1)","v":"B2B3B4"},{"$f":"IF(AND($G2<>\"\",$G2>0,$I2<$E$4),RIGHT(K1,MIN($E$4-$I2,LEN(K1))),K1)","v":""},{"$f":"IF($G2<>\"\",IF($G2<>$B$3,IF(IFERROR(FIND($G2,$E$3)>0,FALSE),TRUE,FALSE),FALSE),FALSE)","v":false},{"$f":"IF(L2,FIND($G2,$E$3),\"\")","v":""},{"$f":"IF(AND(M2<>\"\",M2>0,M2>$E$5),LEFT(N1,MIN(M2-$E$5+3,LEN(N1))),N1)","v":"A3C3"},{"$f":"IF(AND($G2<>\"\",$G2>0,M2<$E$5),RIGHT(O1,MIN($E$5-M2,LEN(O1))),O1)","v":""},{"$f":"IFERROR(IF(AND(G2<>\"\",$G2<>$B$3),FIND(G2,$E$7),\"\"),\"\")","v":""},"A1",{"$f":"IF(P2<>\"\",HLOOKUP(HLOOKUP(Q2,PjasStart,2,FALSE),Pjaser,4,FALSE),0)","v":0},{"$f":"IF(P2<>\"\",OFFSET(Logik!$D$4,0,ROW()-1),0)","v":0},{"$f":"SUBSTITUTE(E6,G2,\"\")","v":"B2B3B4"}]
["Pos:",{"$f":"UPPER(Logik!N1)","v":"B2"},null,"Aräckvidd",{"$f":"IFERROR(INDEX(tblRVB,MATCH(\"VB\"&$B$3,RVB!$A$2:$A$120,0),6),\"\")","v":"A3C3"},{"$f":"Logik!F1","v":"B1"},{"$f":"UPPER(F3)","v":"B1"},{"$f":"IF($G3<>\"\",IF($G3<>$B$3,IF(IFERROR(FIND($G3,$E$2)>0,FALSE),TRUE,FALSE),FALSE),FALSE)","v":false},{"$f":"IF(H3,FIND($G3,$E$2),\"\")","v":""},{"$f":"IF(AND(I3<>\"\",I3>0,I3>$E$4),LEFT(J2,MIN(I3-$E$4+2,LEN(J2))),J2)","v":"B2B3B4"},{"$f":"IF(AND($G3<>\"\",$G3>0,$I3<$E$4),RIGHT(K2,MIN($E$4-$I3,LEN(K2))),K2)","v":""},{"$f":"IF($G3<>\"\",IF($G3<>$B$3,IF(IFERROR(FIND($G3,$E$3)>0,FALSE),TRUE,FALSE),FALSE),FALSE)","v":false},{"$f":"IF(L3,FIND($G3,$E$3),\"\")","v":""},{"$f":"IF(AND(M3<>\"\",M3>0,M3>$E$5),LEFT(N2,MIN(M3-$E$5+3,LEN(N2))),N2)","v":"A3C3"},{"$f":"IF(AND($G3<>\"\",$G3>0,M3<$E$5),RIGHT(O2,MIN($E$5-M3,LEN(O2))),O2)","v":""},{"$f":"IFERROR(IF(AND(G3<>\"\",$G3<>$B$3),FIND(G3,$E$7),\"\"),\"\")","v":""},"B1",0,{"$f":"IF(P3<>\"\",OFFSET(Logik!$D$4,0,ROW()-1),0)","v":0},{"$f":"SUBSTITUTE(T2,G3,\"\")","v":"B2B3B4"}]
["PosX:",{"$f":"LEFT(B3,1)","v":"B"},null,"PosX",{"$f":"FIND(B3,E2)","v":1},{"$f":"Logik!G1","v":"C1"},"C1",false,"","B2B3B4","",false,"","A3C3","","","C1",0,{"$f":"IF(P4<>\"\",OFFSET(Logik!$D$4,0,ROW()-1),0)","v":0},{"$f":"SUBSTITUTE(T3,G4,\"\")","v":"B2B3B4"}]
["PosY:",{"$f":"RIGHT(B3,1)","v":"2"},null,"PosY",{"$f":"IFERROR(FIND(B3,E3),0)","v":0},{"$f":"Logik!H1","v":"D1"},"D1",false,"","B2B3B4","",false,"","A3C3","","","D1",0,{"$f":"IF(P5<>\"\",OFFSET(Logik!$D$4,0,ROW()-1),0)","v":0},"B2B3B4"]
[null,null,null,"RX",{"$f":"K33&J33","v":"B2B3B4"},{"$f":"Logik!I1","v":"E1"},"E1",false,"","B2B3B4","",false,"","A3C3","","","E1",0,{"$f":"IF(P6<>\"\",OFFSET(Logik!$D$4,0,ROW()-1),0)","v":0},"B2B3B4"]
["Poäng",{"$f":"Logik!N3","v":100},null,"RA",{"$f":"O33&N33","v":"A3C3"},{"$f":"Logik!J1","v":"F1"},"F1",false,"","B2B3B4","",false,"","A3C3","","","F1",0,{"$f":"IF(P7<>\"\",OFFSET(Logik!$D$4,0,ROW()-1),0)","v":0},"B2B3B4"]
["PosPoäng",{"$f":"Logik!N4","v":0},null,"RXY",{"$f":"E6&E7","v":"B2B3B4A3C3"},{"$f":"Logik!K1","v":"G1"},"G1",false,"","B2B3B4","",false,"","A3C3","","","G1",0,{"$f":"IF(P8<>\"\",OFFSET(Logik!$D$4,0,ROW()-1),0)","v":0},"B2B3B4"]
[null,null,null,"Försvar",{"$f":"SUM(R2:R17)+SUM(S2:S17)","v":0},{"$f":"Logik!L1","v":"H1"},"H1",false,"","B2B3B4","",false,"","A3C3","","","H1",0,{"$f":"IF(P9<>\"\",OFFSET(Logik!$D$4,0,ROW()-1),0)","v":0},"B2B3B4"]
[null,null,null,"Attack",{"$f":"SUM(R18:R33)+SUM(S18:S33)","v":0},{"$f":"Logik!M1","v":"A2"},"A2",false,"","B2B3B4","",false,"","A3C3","","","A2",0,{"$f":"IF(P10<>\"\",OFFSET(Logik!$D$4,0,ROW()-1),0)","v":0},"B2B3B4"]
[null,null,null,"R Antal",{"$f":"LEN(E8)/2","v":5},{"$f":"Logik!N1","v":"B2"},"B2",false,"","B2B3B4","",false,"","A3C3","","","B2",0,{"$f":"IF(P11<>\"\",OFFSET(Logik!$D$4,0,ROW()-1),0)","v":0},"B3B4"]
[null,null,null,null,null,{"$f":"Logik!O1","v":"C2"},"C2",false,"","B2B3B4","",false,"","A3C3","","","C2",0,{"$f":"IF(P12<>\"\",OFFSET(Logik!$D$4,0,ROW()-1),0)","v":0},"B3B4"]
[null,null,null,"MöjligaDrag",{"$f":"T33","v":"B3B4"},{"$f":"Logik!P1","v":"D2"},"D2",false,"","B2B3B4","",false,"","A3C3","","","D2",0,{"$f":"IF(P13<>\"\",OFFSET(Logik!$D$4,0,ROW()-1),0)","v":0},"B3B4"]
[null,null,null,"D Antal",{"$f":"LEN(E13)/2","v":2},{"$f":"Logik!Q1","v":"E2"},"E2",false,"","B2B3B4","",false,"","A3C3","","","E2",0,{"$f":"IF(P14<>\"\",OFFSET(Logik!$D$4,0,ROW()-1),0)","v":0},"B3B4"]
[null,null,null,null,null,{"$f":"Logik!R1","v":"F2"},"F2",false,"","B2B3B4","",false,"","A3C3","","","F2",0,{"$f":"IF(P15<>\"\",OFFSET(Logik!$D$4,0,ROW()-1),0)","v":0},"B3B4"]
[null,null,null,null,null,{"$f":"Logik!S1","v":"G2"},"G2",false,"","B2B3B4","",false,"","A3C3","","","G2",0,{"$f":"IF(P16<>\"\",OFFSET(Logik!$D$4,0,ROW()-1),0)","v":0},"B3B4"]
[null,null,null,null,null,{"$f":"Logik!T1","v":"H2"},"H2",false,"","B2B3B4","",false,"","A3C3","","","H2",0,{"$f":"IF(P17<>\"\",OFFSET(Logik!$D$4,0,ROW()-1),0)","v":0},"B3B4"]
[null,null,null,null,null,{"$f":"Logik!U1","v":"A7"},"A7",false,"","B2B3B4","",false,"","A3C3","","","A7",{"$f":"IF(P18<>\"\",HLOOKUP(HLOOKUP(Q18,PjasStart,2,FALSE),Pjaser,3,FALSE),0)","v":0},{"$f":"IF(P18<>\"\",OFFSET(Logik!$D$4,0,ROW()-1),0)","v":0},{"$f":"SUBSTITUTE(T17,G18,\"\")&IF(IFERROR(FIND(G18,N18)>0,FALSE),G18,\"\")","v":"B3B4"}]
[null,null,null,null,null,{"$f":"Logik!V1","v":"B7"},"B7",false,"","B2B3B4","",false,"","A3C3","","","B7",0,{"$f":"IF(P19<>\"\",OFFSET(Logik!$D$4,0,ROW()-1),0)","v":0},{"$f":"SUBSTITUTE(T18,G19,\"\")&IF(IFERROR(FIND(G19,N19)>0,FALSE),G19,\"\")","v":"B3B4"}]
[null,null,null,null,null,{"$f":"Logik!W1","v":"C7"},"C7",false,"","B2B3B4","",false,"","A3C3","","","C7",0,{"$f":"IF(P20<>\"\",OFFSET(Logik!$D$4,0,ROW()-1),0)","v":0},"B3B4"]
[null,null,null,null,null,{"$f":"Logik!X1","v":"D7"},"D7",false,"","B2B3B4","",false,"","A3C3","","","D7",0,{"$f":"IF(P21<>\"\",OFFSET(Logik!$D$4,0,ROW()-1),0)","v":0},"B3B4"]
[null,null,null,null,null,{"$f":"Logik!Y1","v":"E7"},"E7",false,"","B2B3B4","",false,"","A3C3","","","E7",0,{"$f":"IF(P22<>\"\",OFFSET(Logik!$D$4,0,ROW()-1),0)","v":0},"B3B4"]
[null,null,null,null,null,{"$f":"Logik!Z1","v":"F7"},"F7",false,"","B2B3B4","",false,"","A3C3","","","F7",0,{"$f":"IF(P23<>\"\",OFFSET(Logik!$D$4,0,ROW()-1),0)","v":0},"B3B4"]
[null,null,null,null,null,{"$f":"Logik!AA1","v":"G7"},"G7",false,"","B2B3B4","",false,"","A3C3","","","G7",0,{"$f":"IF(P24<>\"\",OFFSET(Logik!$D$4,0,ROW()-1),0)","v":0},"B3B4"]
[null,null,null,null,null,{"$f":"Logik!AB1","v":"H7"},"H7",false,"","B2B3B4","",false,"","A3C3","","","H7",0,{"$f":"IF(P25<>\"\",OFFSET(Logik!$D$4,0,ROW()-1),0)","v":0},"B3B4"]
[null,null,null,null,null,{"$f":"Logik!AC1","v":"A8"},"A8",false,"","B2B3B4","",false,"","A3C3","","","A8",0,{"$f":"IF(P26<>\"\",OFFSET(Logik!$D$4,0,ROW()-1),0)","v":0},"B3B4"]
[null,null,null,null,null,{"$f":"Logik!AD1","v":"B8"},"B8",false,"","B2B3B4","",false,"","A3C3","","","B8",0,{"$f":"IF(P27<>\"\",OFFSET(Logik!$D$4,0,ROW()-1),0)","v":0},"B3B4"]
[null,null,null,null,null,{"$f":"Logik!AE1","v":"C8"},"C8",false,"","B2B3B4","",false,"","A3C3","","","C8",0,{"$f":"IF(P28<>\"\",OFFSET(Logik!$D$4,0,ROW()-1),0)","v":0},"B3B4"]
[null,null,null,null,null,{"$f":"Logik!AF1","v":"D8"},"D8",false,"","B2B3B4","",false,"","A3C3","","","D8",0,{"$f":"IF(P29<>\"\",OFFSET(Logik!$D$4,0,ROW()-1),0)","v":0},"B3B4"]
[null,null,null,null,null,{"$f":"Logik!AG1","v":"E8"},"E8",false,"","B2B3B4","",false,"","A3C3","","","E8",0,{"$f":"IF(P30<>\"\",OFFSET(Logik!$D$4,0,ROW()-1),0)","v":0},"B3B4"]
[null,null,null,null,null,{"$f":"Logik!AH1","v":"F8"},"F8",false,"","B2B3B4","",false,"","A3C3","","","F8",0,{"$f":"IF(P31<>\"\",OFFSET(Logik!$D$4,0,ROW()-1),0)","v":0},"B3B4"]
[null,null,null,null,null,{"$f":"Logik!AI1","v":"G8"},"G8",false,"","B2B3B4","",false,"","A3C3","","","G8",0,{"$f":"IF(P32<>\"\",OFFSET(Logik!$D$4,0,ROW()-1),0)","v":0},"B3B4"]
[null,null,null,null,null,{"$f":"Logik!AJ1","v":"H8"},"H8",false,"","B2B3B4","",false,"","A3C3","","","H8",0,{"$f":"IF(P33<>\"\",OFFSET(Logik!$D$4,0,ROW()-1),0)","v":0},"B3B4"]

{"sheet":"P_C2","index":31,"n_rows":33,"n_cols":20,"rows_kept":33,"cut":false,"hidden":true,"merged":[]}
[null,null,null,null,null,{"$f":"Logik!D1","v":"Pos:"},"Pjäs:","Fräckvidd","Pos",{"$f":"RIGHT($E$2,LEN($E$2)-$E$4+1)","v":"C2C3C4"},{"$f":"LEFT($E$2,$E$4-1)","v":""},"Aräckvidd",null,{"$f":"RIGHT($E$3,LEN($E$3)-$E$5+1)","v":"B3D3"},{"$f":"IF(E5=0,\"\",(LEFT($E$3,$E$5-1)))","v":""},"Nåbar","Vad","Poäng","PosPoäng","MöjligaDrag"]
["Pjäs:",{"$f":"Logik!O2","v":"C2"},null,"FRäckvidd",{"$f":"IFERROR(INDEX(tblRVB,MATCH(\"VB\"&$B$3,RVB!$A$2:$A$120,0),5),\"\")","v":"C2C3C4"},{"$f":"UPPER(Logik!E1)","v":"A1"},{"$f":"UPPER(F2)","v":"A1"},{"$f":"IF($G2<>\"\",IF($G2<>$B$3,IF(IFERROR(FIND($G2,$E$2)>0,FALSE),TRUE,FALSE),FALSE),FALSE)","v":false},{"$f":"IF(H2,FIND($G2,$E$2),\"\")","v":""},{"$f":"IF(AND(I2<>\"\",I2>0,I2>$E$4),LEFT(J1,MIN(I2-$E$4+2,LEN(J1))),J1)","v":"C2C3C4"},{"$f":"IF(AND($G2<>\"\",$G2>0,$I2<$E$4),RIGHT(K1,MIN($E$4-$I2,LEN(K1))),K1)","v":""},{"$f":"IF($G2<>\"\",IF($G2<>$B$3,IF(IFERROR(FIND($G2,$E$3)>0,FALSE),TRUE,FALSE),FALSE),FALSE)","v":false},{"$f":"IF(L2,FIND($G2,$E$3),\"\")","v":""},{"$f":"IF(AND(M2<>\"\",M2>0,M2>$E$5),LEFT(N1,MIN(M2-$E$5+3,LEN(N1))),N1)","v":"B3D3"},{"$f":"IF(AND($G2<>\"\",$G2>0,M2<$E$5),RIGHT(O1,MIN($E$5-M2,LEN(O1))),O1)","v":""},{"$f":"IFERROR(IF(AND(G2<>\"\",$G2<>$B$3),FIND(G2,$E$7),\"\"),\"\")","v":""},"A1",{"$f":"IF(P2<>\"\",HLOOKUP(HLOOKUP(Q2,PjasStart,2,FALSE),Pjaser,4,FALSE),0)","v":0},{"$f":"IF(P2<>\"\",OFFSET(Logik!$D$4,0,ROW()-1),0)","v":0},{"$f":"SUBSTITUTE(E6,G2,\"\")","v":"C2C3C4"}]
["Pos:",{"$f":"UPPER(Logik!O1)","v":"C2"},null,"Aräckvidd",{"$f":"IFERROR(INDEX(tblRVB,MATCH(\"VB\"&$B$3,RVB!$A$2:$A$120,0),6),\"\")","v":"B3D3"},{"$f":"Logik!F1","v":"B1"},{"$f":"UPPER(F3)","v":"B1"},{"$f":"IF($G3<>\"\",IF($G3<>$B$3,IF(IFERROR(FIND($G3,$E$2)>0,FALSE),TRUE,FALSE),FALSE),FALSE)","v":false},{"$f":"IF(H3,FIND($G3,$E$2),\"\")","v":""},{"$f":"IF(AND(I3<>\"\",I3>0,I3>$E$4),LEFT(J2,MIN(I3-$E$4+2,LEN(J2))),J2)","v":"C2C3C4"},{"$f":"IF(AND($G3<>\"\",$G3>0,$I3<$E$4),RIGHT(K2,MIN($E$4-$I3,LEN(K2))),K2)","v":""},{"$f":"IF($G3<>\"\",IF($G3<>$B$3,IF(IFERROR(FIND($G3,$E$3)>0,FALSE),TRUE,FALSE),FALSE),FALSE)","v":false},{"$f":"IF(L3,FIND($G3,$E$3),\"\")","v":""},{"$f":"IF(AND(M3<>\"\",M3>0,M3>$E$5),LEFT(N2,MIN(M3-$E$5+3,LEN(N2))),N2)","v":"B3D3"},{"$f":"IF(AND($G3<>\"\",$G3>0,M3<$E$5),RIGHT(O2,MIN($E$5-M3,LEN(O2))),O2)","v":""},{"$f":"IFERROR(IF(AND(G3<>\"\",$G3<>$B$3),FIND(G3,$E$7),\"\"),\"\")","v":""},"B1",0,{"$f":"IF(P3<>\"\",OFFSET(Logik!$D$4,0,ROW()-1),0)","v":0},{"$f":"SUBSTITUTE(T2,G3,\"\")","v":"C2C3C4"}]
["PosX:",{"$f":"LEFT(B3,1)","v":"C"},null,"PosX",{"$f":"FIND(B3,E2)","v":1},{"$f":"Logik!G1","v":"C1"},"C1",false,"","C2C3C4","",false,"","B3D3","","","C1",0,{"$f":"IF(P4<>\"\",OFFSET(Logik!$D$4,0,ROW()-1),0)","v":0},{"$f":"SUBSTITUTE(T3,G4,\"\")","v":"C2C3C4"}]
["PosY:",{"$f":"RIGHT(B3,1)","v":"2"},null,"PosY",{"$f":"IFERROR(FIND(B3,E3),0)","v":0},{"$f":"Logik!H1","v":"D1"},"D1",false,"","C2C3C4","",false,"","B3D3","","","D1",0,{"$f":"IF(P5<>\"\",OFFSET(Logik!$D$4,0,ROW()-1),0)","v":0},"C2C3C4"]
[null,null,null,"RX",{"$f":"K33&J33","v":"C2C3C4"},{"$f":"Logik!I1","v":"E1"},"E1",false,"","C2C3C4","",false,"","B3D3","","","E1",0,{"$f":"IF(P6<>\"\",OFFSET(Logik!$D$4,0,ROW()-1),0)","v":0},"C2C3C4"]
["Poäng",{"$f":"Logik!O3","v":100},null,"RA",{"$f":"O33&N33","v":"B3D3"},{"$f":"Logik!J1","v":"F1"},"F1",false,"","C2C3C4","",false,"","B3D3","","","F1",0,{"$f":"IF(P7<>\"\",OFFSET(Logik!$D$4,0,ROW()-1),0)","v":0},"C2C3C4"]
["PosPoäng",{"$f":"Logik!O4","v":0},null,"RXY",{"$f":"E6&E7","v":"C2C3C4B3D3"},{"$f":"Logik!K1","v":"G1"},"G1",false,"","C2C3C4","",false,"","B3D3","","","G1",0,{"$f":"IF(P8<>\"\",OFFSET(Logik!$D$4,0,ROW()-1),0)","v":0},"C2C3C4"]
[null,null,null,"Försvar",{"$f":"SUM(R2:R17)+SUM(S2:S17)","v":0},{"$f":"Logik!L1","v":"H1"},"H1",false,"","C2C3C4","",false,"","B3D3","","","H1",0,{"$f":"IF(P9<>\"\",OFFSET(Logik!$D$4,0,ROW()-1),0)","v":0},"C2C3C4"]
[null,null,null,"Attack",{"$f":"SUM(R18:R33)+SUM(S18:S33)","v":0},{"$f":"Logik!M1","v":"A2"},"A2",false,"","C2C3C4","",false,"","B3D3","","","A2",0,{"$f":"IF(P10<>\"\",OFFSET(Logik!$D$4,0,ROW()-1),0)","v":0},"C2C3C4"]
[null,null,null,"R Antal",{"$f":"LEN(E8)/2","v":5},{"$f":"Logik!N1","v":"B2"},"B2",false,"","C2C3C4","",false,"","B3D3","","","B2",0,{"$f":"IF(P11<>\"\",OFFSET(Logik!$D$4,0,ROW()-1),0)","v":0},"C2C3C4"]
[null,null,null,null,null,{"$f":"Logik!O1","v":"C2"},"C2",false,"","C2C3C4","",false,"","B3D3","","","C2",0,{"$f":"IF(P12<>\"\",OFFSET(Logik!$D$4,0,ROW()-1),0)","v":0},"C3C4"]
[null,null,null,"MöjligaDrag",{"$f":"T33","v":"C3C4"},{"$f":"Logik!P1","v":"D2"},"D2",false,"","C2C3C4","",false,"","B3D3","","","D2",0,{"$f":"IF(P13<>\"\",OFFSET(Logik!$D$4,0,ROW()-1),0)","v":0},"C3C4"]
[null,null,null,"D Antal",{"$f":"LEN(E13)/2","v":2},{"$f":"Logik!Q1","v":"E2"},"E2",false,"","C2C3C4","",false,"","B3D3","","","E2",0,{"$f":"IF(P14<>\"\",OFFSET(Logik!$D$4,0,ROW()-1),0)","v":0},"C3C4"]
[null,null,null,null,null,{"$f":"Logik!R1","v":"F2"},"F2",false,"","C2C3C4","",false,"","B3D3","","","F2",0,{"$f":"IF(P15<>\"\",OFFSET(Logik!$D$4,0,ROW()-1),0)","v":0},"C3C4"]
[null,null,null,null,null,{"$f":"Logik!S1","v":"G2"},"G2",false,"","C2C3C4","",false,"","B3D3","","","G2",0,{"$f":"IF(P16<>\"\",OFFSET(Logik!$D$4,0,ROW()-1),0)","v":0},"C3C4"]
[null,null,null,null,null,{"$f":"Logik!T1","v":"H2"},"H2",false,"","C2C3C4","",false,"","B3D3","","","H2",0,{"$f":"IF(P17<>\"\",OFFSET(Logik!$D$4,0,ROW()-1),0)","v":0},"C3C4"]
[null,null,null,null,null,{"$f":"Logik!U1","v":"A7"},"A7",false,"","C2C3C4","",false,"","B3D3","","","A7",{"$f":"IF(P18<>\"\",HLOOKUP(HLOOKUP(Q18,PjasStart,2,FALSE),Pjaser,3,FALSE),0)","v":0},{"$f":"IF(P18<>\"\",OFFSET(Logik!$D$4,0,ROW()-1),0)","v":0},{"$f":"SUBSTITUTE(T17,G18,\"\")&IF(IFERROR(FIND(G18,N18)>0,FALSE),G18,\"\")","v":"C3C4"}]
[null,null,null,null,null,{"$f":"Logik!V1","v":"B7"},"B7",false,"","C2C3C4","",false,"","B3D3","","","B7",0,{"$f":"IF(P19<>\"\",OFFSET(Logik!$D$4,0,ROW()-1),0)","v":0},{"$f":"SUBSTITUTE(T18,G19,\"\")&IF(IFERROR(FIND(G19,N19)>0,FALSE),G19,\"\")","v":"C3C4"}]
[null,null,null,null,null,{"$f":"Logik!W1","v":"C7"},"C7",false,"","C2C3C4","",false,"","B3D3","","","C7",0,{"$f":"IF(P20<>\"\",OFFSET(Logik!$D$4,0,ROW()-1),0)","v":0},"C3C4"]
[null,null,null,null,null,{"$f":"Logik!X1","v":"D7"},"D7",false,"","C2C3C4","",false,"","B3D3","","","D7",0,{"$f":"IF(P21<>\"\",OFFSET(Logik!$D$4,0,ROW()-1),0)","v":0},"C3C4"]
[null,null,null,null,null,{"$f":"Logik!Y1","v":"E7"},"E7",false,"","C2C3C4","",false,"","B3D3","","","E7",0,{"$f":"IF(P22<>\"\",OFFSET(Logik!$D$4,0,ROW()-1),0)","v":0},"C3C4"]
[null,null,null,null,null,{"$f":"Logik!Z1","v":"F7"},"F7",false,"","C2C3C4","",false,"","B3D3","","","F7",0,{"$f":"IF(P23<>\"\",OFFSET(Logik!$D$4,0,ROW()-1),0)","v":0},"C3C4"]
[null,null,null,null,null,{"$f":"Logik!AA1","v":"G7"},"G7",false,"","C2C3C4","",false,"","B3D3","","","G7",0,{"$f":"IF(P24<>\"\",OFFSET(Logik!$D$4,0,ROW()-1),0)","v":0},"C3C4"]
[null,null,null,null,null,{"$f":"Logik!AB1","v":"H7"},"H7",false,"","C2C3C4","",false,"","B3D3","","","H7",0,{"$f":"IF(P25<>\"\",OFFSET(Logik!$D$4,0,ROW()-1),0)","v":0},"C3C4"]
[null,null,null,null,null,{"$f":"Logik!AC1","v":"A8"},"A8",false,"","C2C3C4","",false,"","B3D3","","","A8",0,{"$f":"IF(P26<>\"\",OFFSET(Logik!$D$4,0,ROW()-1),0)","v":0},"C3C4"]
[null,null,null,null,null,{"$f":"Logik!AD1","v":"B8"},"B8",false,"","C2C3C4","",false,"","B3D3","","","B8",0,{"$f":"IF(P27<>\"\",OFFSET(Logik!$D$4,0,ROW()-1),0)","v":0},"C3C4"]
[null,null,null,null,null,{"$f":"Logik!AE1","v":"C8"},"C8",false,"","C2C3C4","",false,"","B3D3","","","C8",0,{"$f":"IF(P28<>\"\",OFFSET(Logik!$D$4,0,ROW()-1),0)","v":0},"C3C4"]
[null,null,null,null,null,{"$f":"Logik!AF1","v":"D8"},"D8",false,"","C2C3C4","",false,"","B3D3","","","D8",0,{"$f":"IF(P29<>\"\",OFFSET(Logik!$D$4,0,ROW()-1),0)","v":0},"C3C4"]
[null,null,null,null,null,{"$f":"Logik!AG1","v":"E8"},"E8",false,"","C2C3C4","",false,"","B3D3","","","E8",0,{"$f":"IF(P30<>\"\",OFFSET(Logik!$D$4,0,ROW()-1),0)","v":0},"C3C4"]
[null,null,null,null,null,{"$f":"Logik!AH1","v":"F8"},"F8",false,"","C2C3C4","",false,"","B3D3","","","F8",0,{"$f":"IF(P31<>\"\",OFFSET(Logik!$D$4,0,ROW()-1),0)","v":0},"C3C4"]
[null,null,null,null,null,{"$f":"Logik!AI1","v":"G8"},"G8",false,"","C2C3C4","",false,"","B3D3","","","G8",0,{"$f":"IF(P32<>\"\",OFFSET(Logik!$D$4,0,ROW()-1),0)","v":0},"C3C4"]
[null,null,null,null,null,{"$f":"Logik!AJ1","v":"H8"},"H8",false,"","C2C3C4","",false,"","B3D3","","","H8",0,{"$f":"IF(P33<>\"\",OFFSET(Logik!$D$4,0,ROW()-1),0)","v":0},"C3C4"]

{"sheet":"P_D2","index":32,"n_rows":33,"n_cols":20,"rows_kept":33,"cut":false,"hidden":true,"merged":[]}
[null,null,null,null,null,{"$f":"Logik!D1","v":"Pos:"},"Pjäs:","Fräckvidd","Pos",{"$f":"RIGHT($E$2,LEN($E$2)-$E$4+1)","v":"D2D3D4"},{"$f":"LEFT($E$2,$E$4-1)","v":""},"Aräckvidd",null,{"$f":"RIGHT($E$3,LEN($E$3)-$E$5+1)","v":"C3E3"},{"$f":"IF(E5=0,\"\",(LEFT($E$3,$E$5-1)))","v":""},"Nåbar","Vad","Poäng","PosPoäng","MöjligaDrag"]
["Pjäs:",{"$f":"Logik!P2","v":"D2"},null,"FRäckvidd",{"$f":"IFERROR(INDEX(tblRVB,MATCH(\"VB\"&$B$3,RVB!$A$2:$A$120,0),5),\"\")","v":"D2D3D4"},{"$f":"UPPER(Logik!E1)","v":"A1"},{"$f":"UPPER(F2)","v":"A1"},{"$f":"IF($G2<>\"\",IF($G2<>$B$3,IF(IFERROR(FIND($G2,$E$2)>0,FALSE),TRUE,FALSE),FALSE),FALSE)","v":false},{"$f":"IF(H2,FIND($G2,$E$2),\"\")","v":""},{"$f":"IF(AND(I2<>\"\",I2>0,I2>$E$4),LEFT(J1,MIN(I2-$E$4+2,LEN(J1))),J1)","v":"D2D3D4"},{"$f":"IF(AND($G2<>\"\",$G2>0,$I2<$E$4),RIGHT(K1,MIN($E$4-$I2,LEN(K1))),K1)","v":""},{"$f":"IF($G2<>\"\",IF($G2<>$B$3,IF(IFERROR(FIND($G2,$E$3)>0,FALSE),TRUE,FALSE),FALSE),FALSE)","v":false},{"$f":"IF(L2,FIND($G2,$E$3),\"\")","v":""},{"$f":"IF(AND(M2<>\"\",M2>0,M2>$E$5),LEFT(N1,MIN(M2-$E$5+3,LEN(N1))),N1)","v":"C3E3"},{"$f":"IF(AND($G2<>\"\",$G2>0,M2<$E$5),RIGHT(O1,MIN($E$5-M2,LEN(O1))),O1)","v":""},{"$f":"IFERROR(IF(AND(G2<>\"\",$G2<>$B$3),FIND(G2,$E$7),\"\"),\"\")","v":""},"A1",{"$f":"IF(P2<>\"\",HLOOKUP(HLOOKUP(Q2,PjasStart,2,FALSE),Pjaser,4,FALSE),0)","v":0},{"$f":"IF(P2<>\"\",OFFSET(Logik!$D$4,0,ROW()-1),0)","v":0},{"$f":"SUBSTITUTE(E6,G2,\"\")","v":"D2D3D4"}]
["Pos:",{"$f":"UPPER(Logik!P1)","v":"D2"},null,"Aräckvidd",{"$f":"IFERROR(INDEX(tblRVB,MATCH(\"VB\"&$B$3,RVB!$A$2:$A$120,0),6),\"\")","v":"C3E3"},{"$f":"Logik!F1","v":"B1"},{"$f":"UPPER(F3)","v":"B1"},{"$f":"IF($G3<>\"\",IF($G3<>$B$3,IF(IFERROR(FIND($G3,$E$2)>0,FALSE),TRUE,FALSE),FALSE),FALSE)","v":false},{"$f":"IF(H3,FIND($G3,$E$2),\"\")","v":""},{"$f":"IF(AND(I3<>\"\",I3>0,I3>$E$4),LEFT(J2,MIN(I3-$E$4+2,LEN(J2))),J2)","v":"D2D3D4"},{"$f":"IF(AND($G3<>\"\",$G3>0,$I3<$E$4),RIGHT(K2,MIN($E$4-$I3,LEN(K2))),K2)","v":""},{"$f":"IF($G3<>\"\",IF($G3<>$B$3,IF(IFERROR(FIND($G3,$E$3)>0,FALSE),TRUE,FALSE),FALSE),FALSE)","v":false},{"$f":"IF(L3,FIND($G3,$E$3),\"\")","v":""},{"$f":"IF(AND(M3<>\"\",M3>0,M3>$E$5),LEFT(N2,MIN(M3-$E$5+3,LEN(N2))),N2)","v":"C3E3"},{"$f":"IF(AND($G3<>\"\",$G3>0,M3<$E$5),RIGHT(O2,MIN($E$5-M3,LEN(O2))),O2)","v":""},{"$f":"IFERROR(IF(AND(G3<>\"\",$G3<>$B$3),FIND(G3,$E$7),\"\"),\"\")","v":""},"B1",0,{"$f":"IF(P3<>\"\",OFFSET(Logik!$D$4,0,ROW()-1),0)","v":0},{"$f":"SUBSTITUTE(T2,G3,\"\")","v":"D2D3D4"}]
["PosX:",{"$f":"LEFT(B3,1)","v":"D"},null,"PosX",{"$f":"FIND(B3,E2)","v":1},{"$f":"Logik!G1","v":"C1"},"C1",false,"","D2D3D4","",false,"","C3E3","","","C1",0,{"$f":"IF(P4<>\"\",OFFSET(Logik!$D$4,0,ROW()-1),0)","v":0},{"$f":"SUBSTITUTE(T3,G4,\"\")","v":"D2D3D4"}]
["PosY:",{"$f":"RIGHT(B3,1)","v":"2"},null,"PosY",{"$f":"IFERROR(FIND(B3,E3),0)","v":0},{"$f":"Logik!H1","v":"D1"},"D1",false,"","D2D3D4","",false,"","C3E3","","","D1",0,{"$f":"IF(P5<>\"\",OFFSET(Logik!$D$4,0,ROW()-1),0)","v":0},"D2D3D4"]
[null,null,null,"RX",{"$f":"K33&J33","v":"D2D3D4"},{"$f":"Logik!I1","v":"E1"},"E1",false,"","D2D3D4","",false,"","C3E3","","","E1",0,{"$f":"IF(P6<>\"\",OFFSET(Logik!$D$4,0,ROW()-1),0)","v":0},"D2D3D4"]
["Poäng",{"$f":"Logik!P3","v":100},null,"RA",{"$f":"O33&N33","v":"C3E3"},{"$f":"Logik!J1","v":"F1"},"F1",false,"","D2D3D4","",false,"","C3E3","","","F1",0,{"$f":"IF(P7<>\"\",OFFSET(Logik!$D$4,0,ROW()-1),0)","v":0},"D2D3D4"]
["PosPoäng",{"$f":"Logik!P4","v":0},null,"RXY",{"$f":"E6&E7","v":"D2D3D4C3E3"},{"$f":"Logik!K1","v":"G1"},"G1",false,"","D2D3D4","",false,"","C3E3","","","G1",0,{"$f":"IF(P8<>\"\",OFFSET(Logik!$D$4,0,ROW()-1),0)","v":0},"D2D3D4"]
[null,null,null,"Försvar",{"$f":"SUM(R2:R17)+SUM(S2:S17)","v":0},{"$f":"Logik!L1","v":"H1"},"H1",false,"","D2D3D4","",false,"","C3E3","","","H1",0,{"$f":"IF(P9<>\"\",OFFSET(Logik!$D$4,0,ROW()-1),0)","v":0},"D2D3D4"]
[null,null,null,"Attack",{"$f":"SUM(R18:R33)+SUM(S18:S33)","v":0},{"$f":"Logik!M1","v":"A2"},"A2",false,"","D2D3D4","",false,"","C3E3","","","A2",0,{"$f":"IF(P10<>\"\",OFFSET(Logik!$D$4,0,ROW()-1),0)","v":0},"D2D3D4"]
[null,null,null,"R Antal",{"$f":"LEN(E8)/2","v":5},{"$f":"Logik!N1","v":"B2"},"B2",false,"","D2D3D4","",false,"","C3E3","","","B2",0,{"$f":"IF(P11<>\"\",OFFSET(Logik!$D$4,0,ROW()-1),0)","v":0},"D2D3D4"]
[null,null,null,null,null,{"$f":"Logik!O1","v":"C2"},"C2",false,"","D2D3D4","",false,"","C3E3","","","C2",0,{"$f":"IF(P12<>\"\",OFFSET(Logik!$D$4,0,ROW()-1),0)","v":0},"D2D3D4"]
[null,null,null,"MöjligaDrag",{"$f":"T33","v":"D3D4"},{"$f":"Logik!P1","v":"D2"},"D2",false,"","D2D3D4","",false,"","C3E3","","","D2",0,{"$f":"IF(P13<>\"\",OFFSET(Logik!$D$4,0,ROW()-1),0)","v":0},"D3D4"]
[null,null,null,"D Antal",{"$f":"LEN(E13)/2","v":2},{"$f":"Logik!Q1","v":"E2"},"E2",false,"","D2D3D4","",false,"","C3E3","","","E2",0,{"$f":"IF(P14<>\"\",OFFSET(Logik!$D$4,0,ROW()-1),0)","v":0},"D3D4"]
[null,null,null,null,null,{"$f":"Logik!R1","v":"F2"},"F2",false,"","D2D3D4","",false,"","C3E3","","","F2",0,{"$f":"IF(P15<>\"\",OFFSET(Logik!$D$4,0,ROW()-1),0)","v":0},"D3D4"]
[null,null,null,null,null,{"$f":"Logik!S1","v":"G2"},"G2",false,"","D2D3D4","",false,"","C3E3","","","G2",0,{"$f":"IF(P16<>\"\",OFFSET(Logik!$D$4,0,ROW()-1),0)","v":0},"D3D4"]
[null,null,null,null,null,{"$f":"Logik!T1","v":"H2"},"H2",false,"","D2D3D4","",false,"","C3E3","","","H2",0,{"$f":"IF(P17<>\"\",OFFSET(Logik!$D$4,0,ROW()-1),0)","v":0},"D3D4"]
[null,null,null,null,null,{"$f":"Logik!U1","v":"A7"},"A7",false,"","D2D3D4","",false,"","C3E3","","","A7",{"$f":"IF(P18<>\"\",HLOOKUP(HLOOKUP(Q18,PjasStart,2,FALSE),Pjaser,3,FALSE),0)","v":0},{"$f":"IF(P18<>\"\",OFFSET(Logik!$D$4,0,ROW()-1),0)","v":0},{"$f":"SUBSTITUTE(T17,G18,\"\")&IF(IFERROR(FIND(G18,N18)>0,FALSE),G18,\"\")","v":"D3D4"}]
[null,null,null,null,null,{"$f":"Logik!V1","v":"B7"},"B7",false,"","D2D3D4","",false,"","C3E3","","","B7",0,{"$f":"IF(P19<>\"\",OFFSET(Logik!$D$4,0,ROW()-1),0)","v":0},{"$f":"SUBSTITUTE(T18,G19,\"\")&IF(IFERROR(FIND(G19,N19)>0,FALSE),G19,\"\")","v":"D3D4"}]
[null,null,null,null,null,{"$f":"Logik!W1","v":"C7"},"C7",false,"","D2D3D4","",false,"","C3E3","","","C7",0,{"$f":"IF(P20<>\"\",OFFSET(Logik!$D$4,0,ROW()-1),0)","v":0},"D3D4"]
[null,null,null,null,null,{"$f":"Logik!X1","v":"D7"},"D7",false,"","D2D3D4","",false,"","C3E3","","","D7",0,{"$f":"IF(P21<>\"\",OFFSET(Logik!$D$4,0,ROW()-1),0)","v":0},"D3D4"]
[null,null,null,null,null,{"$f":"Logik!Y1","v":"E7"},"E7",false,"","D2D3D4","",false,"","C3E3","","","E7",0,{"$f":"IF(P22<>\"\",OFFSET(Logik!$D$4,0,ROW()-1),0)","v":0},"D3D4"]
[null,null,null,null,null,{"$f":"Logik!Z1","v":"F7"},"F7",false,"","D2D3D4","",false,"","C3E3","","","F7",0,{"$f":"IF(P23<>\"\",OFFSET(Logik!$D$4,0,ROW()-1),0)","v":0},"D3D4"]
[null,null,null,null,null,{"$f":"Logik!AA1","v":"G7"},"G7",false,"","D2D3D4","",false,"","C3E3","","","G7",0,{"$f":"IF(P24<>\"\",OFFSET(Logik!$D$4,0,ROW()-1),0)","v":0},"D3D4"]
[null,null,null,null,null,{"$f":"Logik!AB1","v":"H7"},"H7",false,"","D2D3D4","",false,"","C3E3","","","H7",0,{"$f":"IF(P25<>\"\",OFFSET(Logik!$D$4,0,ROW()-1),0)","v":0},"D3D4"]
[null,null,null,null,null,{"$f":"Logik!AC1","v":"A8"},"A8",false,"","D2D3D4","",false,"","C3E3","","","A8",0,{"$f":"IF(P26<>\"\",OFFSET(Logik!$D$4,0,ROW()-1),0)","v":0},"D3D4"]
[null,null,null,null,null,{"$f":"Logik!AD1","v":"B8"},"B8",false,"","D2D3D4","",false,"","C3E3","","","B8",0,{"$f":"IF(P27<>\"\",OFFSET(Logik!$D$4,0,ROW()-1),0)","v":0},"D3D4"]
[null,null,null,null,null,{"$f":"Logik!AE1","v":"C8"},"C8",false,"","D2D3D4","",false,"","C3E3","","","C8",0,{"$f":"IF(P28<>\"\",OFFSET(Logik!$D$4,0,ROW()-1),0)","v":0},"D3D4"]
[null,null,null,null,null,{"$f":"Logik!AF1","v":"D8"},"D8",false,"","D2D3D4","",false,"","C3E3","","","D8",0,{"$f":"IF(P29<>\"\",OFFSET(Logik!$D$4,0,ROW()-1),0)","v":0},"D3D4"]
[null,null,null,null,null,{"$f":"Logik!AG1","v":"E8"},"E8",false,"","D2D3D4","",false,"","C3E3","","","E8",0,{"$f":"IF(P30<>\"\",OFFSET(Logik!$D$4,0,ROW()-1),0)","v":0},"D3D4"]
[null,null,null,null,null,{"$f":"Logik!AH1","v":"F8"},"F8",false,"","D2D3D4","",false,"","C3E3","","","F8",0,{"$f":"IF(P31<>\"\",OFFSET(Logik!$D$4,0,ROW()-1),0)","v":0},"D3D4"]
[null,null,null,null,null,{"$f":"Logik!AI1","v":"G8"},"G8",false,"","D2D3D4","",false,"","C3E3","","","G8",0,{"$f":"IF(P32<>\"\",OFFSET(Logik!$D$4,0,ROW()-1),0)","v":0},"D3D4"]
[null,null,null,null,null,{"$f":"Logik!AJ1","v":"H8"},"H8",false,"","D2D3D4","",false,"","C3E3","","","H8",0,{"$f":"IF(P33<>\"\",OFFSET(Logik!$D$4,0,ROW()-1),0)","v":0},"D3D4"]

{"sheet":"P_E2","index":33,"n_rows":33,"n_cols":20,"rows_kept":33,"cut":false,"hidden":true,"merged":[]}
[null,null,null,null,null,{"$f":"Logik!D1","v":"Pos:"},"Pjäs:","Fräckvidd","Pos",{"$f":"RIGHT($E$2,LEN($E$2)-$E$4+1)","v":"E2E3E4"},{"$f":"LEFT($E$2,$E$4-1)","v":""},"Aräckvidd",null,{"$f":"RIGHT($E$3,LEN($E$3)-$E$5+1)","v":"D3F3"},{"$f":"IF(E5=0,\"\",(LEFT($E$3,$E$5-1)))","v":""},"Nåbar","Vad","Poäng","PosPoäng","MöjligaDrag"]
["Pjäs:",{"$f":"Logik!Q2","v":"E2"},null,"FRäckvidd",{"$f":"IFERROR(INDEX(tblRVB,MATCH(\"VB\"&$B$3,RVB!$A$2:$A$120,0),5),\"\")","v":"E2E3E4"},{"$f":"UPPER(Logik!E1)","v":"A1"},{"$f":"UPPER(F2)","v":"A1"},{"$f":"IF($G2<>\"\",IF($G2<>$B$3,IF(IFERROR(FIND($G2,$E$2)>0,FALSE),TRUE,FALSE),FALSE),FALSE)","v":false},{"$f":"IF(H2,FIND($G2,$E$2),\"\")","v":""},{"$f":"IF(AND(I2<>\"\",I2>0,I2>$E$4),LEFT(J1,MIN(I2-$E$4+2,LEN(J1))),J1)","v":"E2E3E4"},{"$f":"IF(AND($G2<>\"\",$G2>0,$I2<$E$4),RIGHT(K1,MIN($E$4-$I2,LEN(K1))),K1)","v":""},{"$f":"IF($G2<>\"\",IF($G2<>$B$3,IF(IFERROR(FIND($G2,$E$3)>0,FALSE),TRUE,FALSE),FALSE),FALSE)","v":false},{"$f":"IF(L2,FIND($G2,$E$3),\"\")","v":""},{"$f":"IF(AND(M2<>\"\",M2>0,M2>$E$5),LEFT(N1,MIN(M2-$E$5+3,LEN(N1))),N1)","v":"D3F3"},{"$f":"IF(AND($G2<>\"\",$G2>0,M2<$E$5),RIGHT(O1,MIN($E$5-M2,LEN(O1))),O1)","v":""},{"$f":"IFERROR(IF(AND(G2<>\"\",$G2<>$B$3),FIND(G2,$E$7),\"\"),\"\")","v":""},"A1",{"$f":"IF(P2<>\"\",HLOOKUP(HLOOKUP(Q2,PjasStart,2,FALSE),Pjaser,4,FALSE),0)","v":0},{"$f":"IF(P2<>\"\",OFFSET(Logik!$D$4,0,ROW()-1),0)","v":0},{"$f":"SUBSTITUTE(E6,G2,\"\")","v":"E2E3E4"}]
["Pos:",{"$f":"UPPER(Logik!Q1)","v":"E2"},null,"Aräckvidd",{"$f":"IFERROR(INDEX(tblRVB,MATCH(\"VB\"&$B$3,RVB!$A$2:$A$120,0),6),\"\")","v":"D3F3"},{"$f":"Logik!F1","v":"B1"},{"$f":"UPPER(F3)","v":"B1"},{"$f":"IF($G3<>\"\",IF($G3<>$B$3,IF(IFERROR(FIND($G3,$E$2)>0,FALSE),TRUE,FALSE),FALSE),FALSE)","v":false},{"$f":"IF(H3,FIND($G3,$E$2),\"\")","v":""},{"$f":"IF(AND(I3<>\"\",I3>0,I3>$E$4),LEFT(J2,MIN(I3-$E$4+2,LEN(J2))),J2)","v":"E2E3E4"},{"$f":"IF(AND($G3<>\"\",$G3>0,$I3<$E$4),RIGHT(K2,MIN($E$4-$I3,LEN(K2))),K2)","v":""},{"$f":"IF($G3<>\"\",IF($G3<>$B$3,IF(IFERROR(FIND($G3,$E$3)>0,FALSE),TRUE,FALSE),FALSE),FALSE)","v":false},{"$f":"IF(L3,FIND($G3,$E$3),\"\")","v":""},{"$f":"IF(AND(M3<>\"\",M3>0,M3>$E$5),LEFT(N2,MIN(M3-$E$5+3,LEN(N2))),N2)","v":"D3F3"},{"$f":"IF(AND($G3<>\"\",$G3>0,M3<$E$5),RIGHT(O2,MIN($E$5-M3,LEN(O2))),O2)","v":""},{"$f":"IFERROR(IF(AND(G3<>\"\",$G3<>$B$3),FIND(G3,$E$7),\"\"),\"\")","v":""},"B1",0,{"$f":"IF(P3<>\"\",OFFSET(Logik!$D$4,0,ROW()-1),0)","v":0},{"$f":"SUBSTITUTE(T2,G3,\"\")","v":"E2E3E4"}]
["PosX:",{"$f":"LEFT(B3,1)","v":"E"},null,"PosX",{"$f":"FIND(B3,E2)","v":1},{"$f":"Logik!G1","v":"C1"},"C1",false,"","E2E3E4","",false,"","D3F3","","","C1",0,{"$f":"IF(P4<>\"\",OFFSET(Logik!$D$4,0,ROW()-1),0)","v":0},{"$f":"SUBSTITUTE(T3,G4,\"\")","v":"E2E3E4"}]
["PosY:",{"$f":"RIGHT(B3,1)","v":"2"},null,"PosY",{"$f":"IFERROR(FIND(B3,E3),0)","v":0},{"$f":"Logik!H1","v":"D1"},"D1",false,"","E2E3E4","",false,"","D3F3","","","D1",0,{"$f":"IF(P5<>\"\",OFFSET(Logik!$D$4,0,ROW()-1),0)","v":0},"E2E3E4"]
[null,null,null,"RX",{"$f":"K33&J33","v":"E2E3E4"},{"$f":"Logik!I1","v":"E1"},"E1",false,"","E2E3E4","",false,"","D3F3","","","E1",0,{"$f":"IF(P6<>\"\",OFFSET(Logik!$D$4,0,ROW()-1),0)","v":0},"E2E3E4"]
["Poäng",{"$f":"Logik!Q3","v":100},null,"RA",{"$f":"O33&N33","v":"D3F3"},{"$f":"Logik!J1","v":"F1"},"F1",false,"","E2E3E4","",false,"","D3F3","","","F1",0,{"$f":"IF(P7<>\"\",OFFSET(Logik!$D$4,0,ROW()-1),0)","v":0},"E2E3E4"]
["PosPoäng",{"$f":"Logik!Q4","v":0},null,"RXY",{"$f":"E6&E7","v":"E2E3E4D3F3"},{"$f":"Logik!K1","v":"G1"},"G1",false,"","E2E3E4","",false,"","D3F3","","","G1",0,{"$f":"IF(P8<>\"\",OFFSET(Logik!$D$4,0,ROW()-1),0)","v":0},"E2E3E4"]
[null,null,null,"Försvar",{"$f":"SUM(R2:R17)+SUM(S2:S17)","v":0},{"$f":"Logik!L1","v":"H1"},"H1",false,"","E2E3E4","",false,"","D3F3","","","H1",0,{"$f":"IF(P9<>\"\",OFFSET(Logik!$D$4,0,ROW()-1),0)","v":0},"E2E3E4"]
[null,null,null,"Attack",{"$f":"SUM(R18:R33)+SUM(S18:S33)","v":0},{"$f":"Logik!M1","v":"A2"},"A2",false,"","E2E3E4","",false,"","D3F3","","","A2",0,{"$f":"IF(P10<>\"\",OFFSET(Logik!$D$4,0,ROW()-1),0)","v":0},"E2E3E4"]
[null,null,null,"R Antal",{"$f":"LEN(E8)/2","v":5},{"$f":"Logik!N1","v":"B2"},"B2",false,"","E2E3E4","",false,"","D3F3","","","B2",0,{"$f":"IF(P11<>\"\",OFFSET(Logik!$D$4,0,ROW()-1),0)","v":0},"E2E3E4"]
[null,null,null,null,null,{"$f":"Logik!O1","v":"C2"},"C2",false,"","E2E3E4","",false,"","D3F3","","","C2",0,{"$f":"IF(P12<>\"\",OFFSET(Logik!$D$4,0,ROW()-1),0)","v":0},"E2E3E4"]
[null,null,null,"MöjligaDrag",{"$f":"T33","v":"E3E4"},{"$f":"Logik!P1","v":"D2"},"D2",false,"","E2E3E4","",false,"","D3F3","","","D2",0,{"$f":"IF(P13<>\"\",OFFSET(Logik!$D$4,0,ROW()-1),0)","v":0},"E2E3E4"]
[null,null,null,"D Antal",{"$f":"LEN(E13)/2","v":2},{"$f":"Logik!Q1","v":"E2"},"E2",false,"","E2E3E4","",false,"","D3F3","","","E2",0,{"$f":"IF(P14<>\"\",OFFSET(Logik!$D$4,0,ROW()-1),0)","v":0},"E3E4"]
[null,null,null,null,null,{"$f":"Logik!R1","v":"F2"},"F2",false,"","E2E3E4","",false,"","D3F3","","","F2",0,{"$f":"IF(P15<>\"\",OFFSET(Logik!$D$4,0,ROW()-1),0)","v":0},"E3E4"]
[null,null,null,null,null,{"$f":"Logik!S1","v":"G2"},"G2",false,"","E2E3E4","",false,"","D3F3","","","G2",0,{"$f":"IF(P16<>\"\",OFFSET(Logik!$D$4,0,ROW()-1),0)","v":0},"E3E4"]
[null,null,null,null,null,{"$f":"Logik!T1","v":"H2"},"H2",false,"","E2E3E4","",false,"","D3F3","","","H2",0,{"$f":"IF(P17<>\"\",OFFSET(Logik!$D$4,0,ROW()-1),0)","v":0},"E3E4"]
[null,null,null,null,null,{"$f":"Logik!U1","v":"A7"},"A7",false,"","E2E3E4","",false,"","D3F3","","","A7",{"$f":"IF(P18<>\"\",HLOOKUP(HLOOKUP(Q18,PjasStart,2,FALSE),Pjaser,3,FALSE),0)","v":0},{"$f":"IF(P18<>\"\",OFFSET(Logik!$D$4,0,ROW()-1),0)","v":0},{"$f":"SUBSTITUTE(T17,G18,\"\")&IF(IFERROR(FIND(G18,N18)>0,FALSE),G18,\"\")","v":"E3E4"}]
[null,null,null,null,null,{"$f":"Logik!V1","v":"B7"},"B7",false,"","E2E3E4","",false,"","D3F3","","","B7",0,{"$f":"IF(P19<>\"\",OFFSET(Logik!$D$4,0,ROW()-1),0)","v":0},{"$f":"SUBSTITUTE(T18,G19,\"\")&IF(IFERROR(FIND(G19,N19)>0,FALSE),G19,\"\")","v":"E3E4"}]
[null,null,null,null,null,{"$f":"Logik!W1","v":"C7"},"C7",false,"","E2E3E4","",false,"","D3F3","","","C7",0,{"$f":"IF(P20<>\"\",OFFSET(Logik!$D$4,0,ROW()-1),0)","v":0},"E3E4"]
[null,null,null,null,null,{"$f":"Logik!X1","v":"D7"},"D7",false,"","E2E3E4","",false,"","D3F3","","","D7",0,{"$f":"IF(P21<>\"\",OFFSET(Logik!$D$4,0,ROW()-1),0)","v":0},"E3E4"]
[null,null,null,null,null,{"$f":"Logik!Y1","v":"E7"},"E7",false,"","E2E3E4","",false,"","D3F3","","","E7",0,{"$f":"IF(P22<>\"\",OFFSET(Logik!$D$4,0,ROW()-1),0)","v":0},"E3E4"]
[null,null,null,null,null,{"$f":"Logik!Z1","v":"F7"},"F7",false,"","E2E3E4","",false,"","D3F3","","","F7",0,{"$f":"IF(P23<>\"\",OFFSET(Logik!$D$4,0,ROW()-1),0)","v":0},"E3E4"]
[null,null,null,null,null,{"$f":"Logik!AA1","v":"G7"},"G7",false,"","E2E3E4","",false,"","D3F3","","","G7",0,{"$f":"IF(P24<>\"\",OFFSET(Logik!$D$4,0,ROW()-1),0)","v":0},"E3E4"]
[null,null,null,null,null,{"$f":"Logik!AB1","v":"H7"},"H7",false,"","E2E3E4","",false,"","D3F3","","","H7",0,{"$f":"IF(P25<>\"\",OFFSET(Logik!$D$4,0,ROW()-1),0)","v":0},"E3E4"]
[null,null,null,null,null,{"$f":"Logik!AC1","v":"A8"},"A8",false,"","E2E3E4","",false,"","D3F3","","","A8",0,{"$f":"IF(P26<>\"\",OFFSET(Logik!$D$4,0,ROW()-1),0)","v":0},"E3E4"]
[null,null,null,null,null,{"$f":"Logik!AD1","v":"B8"},"B8",false,"","E2E3E4","",false,"","D3F3","","","B8",0,{"$f":"IF(P27<>\"\",OFFSET(Logik!$D$4,0,ROW()-1),0)","v":0},"E3E4"]
[null,null,null,null,null,{"$f":"Logik!AE1","v":"C8"},"C8",false,"","E2E3E4","",false,"","D3F3","","","C8",0,{"$f":"IF(P28<>\"\",OFFSET(Logik!$D$4,0,ROW()-1),0)","v":0},"E3E4"]
[null,null,null,null,null,{"$f":"Logik!AF1","v":"D8"},"D8",false,"","E2E3E4","",false,"","D3F3","","","D8",0,{"$f":"IF(P29<>\"\",OFFSET(Logik!$D$4,0,ROW()-1),0)","v":0},"E3E4"]
[null,null,null,null,null,{"$f":"Logik!AG1","v":"E8"},"E8",false,"","E2E3E4","",false,"","D3F3","","","E8",0,{"$f":"IF(P30<>\"\",OFFSET(Logik!$D$4,0,ROW()-1),0)","v":0},"E3E4"]
[null,null,null,null,null,{"$f":"Logik!AH1","v":"F8"},"F8",false,"","E2E3E4","",false,"","D3F3","","","F8",0,{"$f":"IF(P31<>\"\",OFFSET(Logik!$D$4,0,ROW()-1),0)","v":0},"E3E4"]
[null,null,null,null,null,{"$f":"Logik!AI1","v":"G8"},"G8",false,"","E2E3E4","",false,"","D3F3","","","G8",0,{"$f":"IF(P32<>\"\",OFFSET(Logik!$D$4,0,ROW()-1),0)","v":0},"E3E4"]
[null,null,null,null,null,{"$f":"Logik!AJ1","v":"H8"},"H8",false,"","E2E3E4","",false,"","D3F3","","","H8",0,{"$f":"IF(P33<>\"\",OFFSET(Logik!$D$4,0,ROW()-1),0)","v":0},"E3E4"]

{"sheet":"P_F2","index":34,"n_rows":33,"n_cols":20,"rows_kept":33,"cut":false,"hidden":true,"merged":[]}
[null,null,null,null,null,{"$f":"Logik!D1","v":"Pos:"},"Pjäs:","Fräckvidd","Pos",{"$f":"RIGHT($E$2,LEN($E$2)-$E$4+1)","v":"F2F3F4"},{"$f":"LEFT($E$2,$E$4-1)","v":""},"Aräckvidd",null,{"$f":"RIGHT($E$3,LEN($E$3)-$E$5+1)","v":"E3G3"},{"$f":"IF(E5=0,\"\",(LEFT($E$3,$E$5-1)))","v":""},"Nåbar","Vad","Poäng","PosPoäng","MöjligaDrag"]
["Pjäs:",{"$f":"Logik!R2","v":"F2"},null,"FRäckvidd",{"$f":"IFERROR(INDEX(tblRVB,MATCH(\"VB\"&$B$3,RVB!$A$2:$A$120,0),5),\"\")","v":"F2F3F4"},{"$f":"UPPER(Logik!E1)","v":"A1"},{"$f":"UPPER(F2)","v":"A1"},{"$f":"IF($G2<>\"\",IF($G2<>$B$3,IF(IFERROR(FIND($G2,$E$2)>0,FALSE),TRUE,FALSE),FALSE),FALSE)","v":false},{"$f":"IF(H2,FIND($G2,$E$2),\"\")","v":""},{"$f":"IF(AND(I2<>\"\",I2>0,I2>$E$4),LEFT(J1,MIN(I2-$E$4+2,LEN(J1))),J1)","v":"F2F3F4"},{"$f":"IF(AND($G2<>\"\",$G2>0,$I2<$E$4),RIGHT(K1,MIN($E$4-$I2,LEN(K1))),K1)","v":""},{"$f":"IF($G2<>\"\",IF($G2<>$B$3,IF(IFERROR(FIND($G2,$E$3)>0,FALSE),TRUE,FALSE),FALSE),FALSE)","v":false},{"$f":"IF(L2,FIND($G2,$E$3),\"\")","v":""},{"$f":"IF(AND(M2<>\"\",M2>0,M2>$E$5),LEFT(N1,MIN(M2-$E$5+3,LEN(N1))),N1)","v":"E3G3"},{"$f":"IF(AND($G2<>\"\",$G2>0,M2<$E$5),RIGHT(O1,MIN($E$5-M2,LEN(O1))),O1)","v":""},{"$f":"IFERROR(IF(AND(G2<>\"\",$G2<>$B$3),FIND(G2,$E$7),\"\"),\"\")","v":""},"A1",{"$f":"IF(P2<>\"\",HLOOKUP(HLOOKUP(Q2,PjasStart,2,FALSE),Pjaser,4,FALSE),0)","v":0},{"$f":"IF(P2<>\"\",OFFSET(Logik!$D$4,0,ROW()-1),0)","v":0},{"$f":"SUBSTITUTE(E6,G2,\"\")","v":"F2F3F4"}]
["Pos:",{"$f":"UPPER(Logik!R1)","v":"F2"},null,"Aräckvidd",{"$f":"IFERROR(INDEX(tblRVB,MATCH(\"VB\"&$B$3,RVB!$A$2:$A$120,0),6),\"\")","v":"E3G3"},{"$f":"Logik!F1","v":"B1"},{"$f":"UPPER(F3)","v":"B1"},{"$f":"IF($G3<>\"\",IF($G3<>$B$3,IF(IFERROR(FIND($G3,$E$2)>0,FALSE),TRUE,FALSE),FALSE),FALSE)","v":false},{"$f":"IF(H3,FIND($G3,$E$2),\"\")","v":""},{"$f":"IF(AND(I3<>\"\",I3>0,I3>$E$4),LEFT(J2,MIN(I3-$E$4+2,LEN(J2))),J2)","v":"F2F3F4"},{"$f":"IF(AND($G3<>\"\",$G3>0,$I3<$E$4),RIGHT(K2,MIN($E$4-$I3,LEN(K2))),K2)","v":""},{"$f":"IF($G3<>\"\",IF($G3<>$B$3,IF(IFERROR(FIND($G3,$E$3)>0,FALSE),TRUE,FALSE),FALSE),FALSE)","v":false},{"$f":"IF(L3,FIND($G3,$E$3),\"\")","v":""},{"$f":"IF(AND(M3<>\"\",M3>0,M3>$E$5),LEFT(N2,MIN(M3-$E$5+3,LEN(N2))),N2)","v":"E3G3"},{"$f":"IF(AND($G3<>\"\",$G3>0,M3<$E$5),RIGHT(O2,MIN($E$5-M3,LEN(O2))),O2)","v":""},{"$f":"IFERROR(IF(AND(G3<>\"\",$G3<>$B$3),FIND(G3,$E$7),\"\"),\"\")","v":""},"B1",0,{"$f":"IF(P3<>\"\",OFFSET(Logik!$D$4,0,ROW()-1),0)","v":0},{"$f":"SUBSTITUTE(T2,G3,\"\")","v":"F2F3F4"}]
["PosX:",{"$f":"LEFT(B3,1)","v":"F"},null,"PosX",{"$f":"FIND(B3,E2)","v":1},{"$f":"Logik!G1","v":"C1"},"C1",false,"","F2F3F4","",false,"","E3G3","","","C1",0,{"$f":"IF(P4<>\"\",OFFSET(Logik!$D$4,0,ROW()-1),0)","v":0},{"$f":"SUBSTITUTE(T3,G4,\"\")","v":"F2F3F4"}]
["PosY:",{"$f":"RIGHT(B3,1)","v":"2"},null,"PosY",{"$f":"IFERROR(FIND(B3,E3),0)","v":0},{"$f":"Logik!H1","v":"D1"},"D1",false,"","F2F3F4","",false,"","E3G3","","","D1",0,{"$f":"IF(P5<>\"\",OFFSET(Logik!$D$4,0,ROW()-1),0)","v":0},"F2F3F4"]
[null,null,null,"RX",{"$f":"K33&J33","v":"F2F3F4"},{"$f":"Logik!I1","v":"E1"},"E1",false,"","F2F3F4","",false,"","E3G3","","","E1",0,{"$f":"IF(P6<>\"\",OFFSET(Logik!$D$4,0,ROW()-1),0)","v":0},"F2F3F4"]
["Poäng",{"$f":"Logik!R3","v":100},null,"RA",{"$f":"O33&N33","v":"E3G3"},{"$f":"Logik!J1","v":"F1"},"F1",false,"","F2F3F4","",false,"","E3G3","","","F1",0,{"$f":"IF(P7<>\"\",OFFSET(Logik!$D$4,0,ROW()-1),0)","v":0},"F2F3F4"]
["PosPoäng",{"$f":"Logik!R4","v":0},null,"RXY",{"$f":"E6&E7","v":"F2F3F4E3G3"},{"$f":"Logik!K1","v":"G1"},"G1",false,"","F2F3F4","",false,"","E3G3","","","G1",0,{"$f":"IF(P8<>\"\",OFFSET(Logik!$D$4,0,ROW()-1),0)","v":0},"F2F3F4"]
[null,null,null,"Försvar",{"$f":"SUM(R2:R17)+SUM(S2:S17)","v":0},{"$f":"Logik!L1","v":"H1"},"H1",false,"","F2F3F4","",false,"","E3G3","","","H1",0,{"$f":"IF(P9<>\"\",OFFSET(Logik!$D$4,0,ROW()-1),0)","v":0},"F2F3F4"]
[null,null,null,"Attack",{"$f":"SUM(R18:R33)+SUM(S18:S33)","v":0},{"$f":"Logik!M1","v":"A2"},"A2",false,"","F2F3F4","",false,"","E3G3","","","A2",0,{"$f":"IF(P10<>\"\",OFFSET(Logik!$D$4,0,ROW()-1),0)","v":0},"F2F3F4"]
[null,null,null,"R Antal",{"$f":"LEN(E8)/2","v":5},{"$f":"Logik!N1","v":"B2"},"B2",false,"","F2F3F4","",false,"","E3G3","","","B2",0,{"$f":"IF(P11<>\"\",OFFSET(Logik!$D$4,0,ROW()-1),0)","v":0},"F2F3F4"]
[null,null,null,null,null,{"$f":"Logik!O1","v":"C2"},"C2",false,"","F2F3F4","",false,"","E3G3","","","C2",0,{"$f":"IF(P12<>\"\",OFFSET(Logik!$D$4,0,ROW()-1),0)","v":0},"F2F3F4"]
[null,null,null,"MöjligaDrag",{"$f":"T33","v":"F3F4"},{"$f":"Logik!P1","v":"D2"},"D2",false,"","F2F3F4","",false,"","E3G3","","","D2",0,{"$f":"IF(P13<>\"\",OFFSET(Logik!$D$4,0,ROW()-1),0)","v":0},"F2F3F4"]
[null,null,null,"D Antal",{"$f":"LEN(E13)/2","v":2},{"$f":"Logik!Q1","v":"E2"},"E2",false,"","F2F3F4","",false,"","E3G3","","","E2",0,{"$f":"IF(P14<>\"\",OFFSET(Logik!$D$4,0,ROW()-1),0)","v":0},"F2F3F4"]
[null,null,null,null,null,{"$f":"Logik!R1","v":"F2"},"F2",false,"","F2F3F4","",false,"","E3G3","","","F2",0,{"$f":"IF(P15<>\"\",OFFSET(Logik!$D$4,0,ROW()-1),0)","v":0},"F3F4"]
[null,null,null,null,null,{"$f":"Logik!S1","v":"G2"},"G2",false,"","F2F3F4","",false,"","E3G3","","","G2",0,{"$f":"IF(P16<>\"\",OFFSET(Logik!$D$4,0,ROW()-1),0)","v":0},"F3F4"]
[null,null,null,null,null,{"$f":"Logik!T1","v":"H2"},"H2",false,"","F2F3F4","",false,"","E3G3","","","H2",0,{"$f":"IF(P17<>\"\",OFFSET(Logik!$D$4,0,ROW()-1),0)","v":0},"F3F4"]
[null,null,null,null,null,{"$f":"Logik!U1","v":"A7"},"A7",false,"","F2F3F4","",false,"","E3G3","","","A7",{"$f":"IF(P18<>\"\",HLOOKUP(HLOOKUP(Q18,PjasStart,2,FALSE),Pjaser,3,FALSE),0)","v":0},{"$f":"IF(P18<>\"\",OFFSET(Logik!$D$4,0,ROW()-1),0)","v":0},{"$f":"SUBSTITUTE(T17,G18,\"\")&IF(IFERROR(FIND(G18,N18)>0,FALSE),G18,\"\")","v":"F3F4"}]
[null,null,null,null,null,{"$f":"Logik!V1","v":"B7"},"B7",false,"","F2F3F4","",false,"","E3G3","","","B7",0,{"$f":"IF(P19<>\"\",OFFSET(Logik!$D$4,0,ROW()-1),0)","v":0},{"$f":"SUBSTITUTE(T18,G19,\"\")&IF(IFERROR(FIND(G19,N19)>0,FALSE),G19,\"\")","v":"F3F4"}]
[null,null,null,null,null,{"$f":"Logik!W1","v":"C7"},"C7",false,"","F2F3F4","",false,"","E3G3","","","C7",0,{"$f":"IF(P20<>\"\",OFFSET(Logik!$D$4,0,ROW()-1),0)","v":0},"F3F4"]
[null,null,null,null,null,{"$f":"Logik!X1","v":"D7"},"D7",false,"","F2F3F4","",false,"","E3G3","","","D7",0,{"$f":"IF(P21<>\"\",OFFSET(Logik!$D$4,0,ROW()-1),0)","v":0},"F3F4"]
[null,null,null,null,null,{"$f":"Logik!Y1","v":"E7"},"E7",false,"","F2F3F4","",false,"","E3G3","","","E7",0,{"$f":"IF(P22<>\"\",OFFSET(Logik!$D$4,0,ROW()-1),0)","v":0},"F3F4"]
[null,null,null,null,null,{"$f":"Logik!Z1","v":"F7"},"F7",false,"","F2F3F4","",false,"","E3G3","","","F7",0,{"$f":"IF(P23<>\"\",OFFSET(Logik!$D$4,0,ROW()-1),0)","v":0},"F3F4"]
[null,null,null,null,null,{"$f":"Logik!AA1","v":"G7"},"G7",false,"","F2F3F4","",false,"","E3G3","","","G7",0,{"$f":"IF(P24<>\"\",OFFSET(Logik!$D$4,0,ROW()-1),0)","v":0},"F3F4"]
[null,null,null,null,null,{"$f":"Logik!AB1","v":"H7"},"H7",false,"","F2F3F4","",false,"","E3G3","","","H7",0,{"$f":"IF(P25<>\"\",OFFSET(Logik!$D$4,0,ROW()-1),0)","v":0},"F3F4"]
[null,null,null,null,null,{"$f":"Logik!AC1","v":"A8"},"A8",false,"","F2F3F4","",false,"","E3G3","","","A8",0,{"$f":"IF(P26<>\"\",OFFSET(Logik!$D$4,0,ROW()-1),0)","v":0},"F3F4"]
[null,null,null,null,null,{"$f":"Logik!AD1","v":"B8"},"B8",false,"","F2F3F4","",false,"","E3G3","","","B8",0,{"$f":"IF(P27<>\"\",OFFSET(Logik!$D$4,0,ROW()-1),0)","v":0},"F3F4"]
[null,null,null,null,null,{"$f":"Logik!AE1","v":"C8"},"C8",false,"","F2F3F4","",false,"","E3G3","","","C8",0,{"$f":"IF(P28<>\"\",OFFSET(Logik!$D$4,0,ROW()-1),0)","v":0},"F3F4"]
[null,null,null,null,null,{"$f":"Logik!AF1","v":"D8"},"D8",false,"","F2F3F4","",false,"","E3G3","","","D8",0,{"$f":"IF(P29<>\"\",OFFSET(Logik!$D$4,0,ROW()-1),0)","v":0},"F3F4"]
[null,null,null,null,null,{"$f":"Logik!AG1","v":"E8"},"E8",false,"","F2F3F4","",false,"","E3G3","","","E8",0,{"$f":"IF(P30<>\"\",OFFSET(Logik!$D$4,0,ROW()-1),0)","v":0},"F3F4"]
[null,null,null,null,null,{"$f":"Logik!AH1","v":"F8"},"F8",false,"","F2F3F4","",false,"","E3G3","","","F8",0,{"$f":"IF(P31<>\"\",OFFSET(Logik!$D$4,0,ROW()-1),0)","v":0},"F3F4"]
[null,null,null,null,null,{"$f":"Logik!AI1","v":"G8"},"G8",false,"","F2F3F4","",false,"","E3G3","","","G8",0,{"$f":"IF(P32<>\"\",OFFSET(Logik!$D$4,0,ROW()-1),0)","v":0},"F3F4"]
[null,null,null,null,null,{"$f":"Logik!AJ1","v":"H8"},"H8",false,"","F2F3F4","",false,"","E3G3","","","H8",0,{"$f":"IF(P33<>\"\",OFFSET(Logik!$D$4,0,ROW()-1),0)","v":0},"F3F4"]

{"sheet":"P_G2","index":35,"n_rows":33,"n_cols":20,"rows_kept":33,"cut":false,"hidden":true,"merged":[]}
[null,null,null,null,null,{"$f":"Logik!D1","v":"Pos:"},"Pjäs:","Fräckvidd","Pos",{"$f":"RIGHT($E$2,LEN($E$2)-$E$4+1)","v":"G2G3G4"},{"$f":"LEFT($E$2,$E$4-1)","v":""},"Aräckvidd",null,{"$f":"RIGHT($E$3,LEN($E$3)-$E$5+1)","v":"F3H3"},{"$f":"IF(E5=0,\"\",(LEFT($E$3,$E$5-1)))","v":""},"Nåbar","Vad","Poäng","PosPoäng","MöjligaDrag"]
["Pjäs:",{"$f":"Logik!S2","v":"G2"},null,"FRäckvidd",{"$f":"IFERROR(INDEX(tblRVB,MATCH(\"VB\"&$B$3,RVB!$A$2:$A$120,0),5),\"\")","v":"G2G3G4"},{"$f":"UPPER(Logik!E1)","v":"A1"},{"$f":"UPPER(F2)","v":"A1"},{"$f":"IF($G2<>\"\",IF($G2<>$B$3,IF(IFERROR(FIND($G2,$E$2)>0,FALSE),TRUE,FALSE),FALSE),FALSE)","v":false},{"$f":"IF(H2,FIND($G2,$E$2),\"\")","v":""},{"$f":"IF(AND(I2<>\"\",I2>0,I2>$E$4),LEFT(J1,MIN(I2-$E$4+2,LEN(J1))),J1)","v":"G2G3G4"},{"$f":"IF(AND($G2<>\"\",$G2>0,$I2<$E$4),RIGHT(K1,MIN($E$4-$I2,LEN(K1))),K1)","v":""},{"$f":"IF($G2<>\"\",IF($G2<>$B$3,IF(IFERROR(FIND($G2,$E$3)>0,FALSE),TRUE,FALSE),FALSE),FALSE)","v":false},{"$f":"IF(L2,FIND($G2,$E$3),\"\")","v":""},{"$f":"IF(AND(M2<>\"\",M2>0,M2>$E$5),LEFT(N1,MIN(M2-$E$5+3,LEN(N1))),N1)","v":"F3H3"},{"$f":"IF(AND($G2<>\"\",$G2>0,M2<$E$5),RIGHT(O1,MIN($E$5-M2,LEN(O1))),O1)","v":""},{"$f":"IFERROR(IF(AND(G2<>\"\",$G2<>$B$3),FIND(G2,$E$7),\"\"),\"\")","v":""},"A1",{"$f":"IF(P2<>\"\",HLOOKUP(HLOOKUP(Q2,PjasStart,2,FALSE),Pjaser,4,FALSE),0)","v":0},{"$f":"IF(P2<>\"\",OFFSET(Logik!$D$4,0,ROW()-1),0)","v":0},{"$f":"SUBSTITUTE(E6,G2,\"\")","v":"G2G3G4"}]
["Pos:",{"$f":"UPPER(Logik!S1)","v":"G2"},null,"Aräckvidd",{"$f":"IFERROR(INDEX(tblRVB,MATCH(\"VB\"&$B$3,RVB!$A$2:$A$120,0),6),\"\")","v":"F3H3"},{"$f":"Logik!F1","v":"B1"},{"$f":"UPPER(F3)","v":"B1"},{"$f":"IF($G3<>\"\",IF($G3<>$B$3,IF(IFERROR(FIND($G3,$E$2)>0,FALSE),TRUE,FALSE),FALSE),FALSE)","v":false},{"$f":"IF(H3,FIND($G3,$E$2),\"\")","v":""},{"$f":"IF(AND(I3<>\"\",I3>0,I3>$E$4),LEFT(J2,MIN(I3-$E$4+2,LEN(J2))),J2)","v":"G2G3G4"},{"$f":"IF(AND($G3<>\"\",$G3>0,$I3<$E$4),RIGHT(K2,MIN($E$4-$I3,LEN(K2))),K2)","v":""},{"$f":"IF($G3<>\"\",IF($G3<>$B$3,IF(IFERROR(FIND($G3,$E$3)>0,FALSE),TRUE,FALSE),FALSE),FALSE)","v":false},{"$f":"IF(L3,FIND($G3,$E$3),\"\")","v":""},{"$f":"IF(AND(M3<>\"\",M3>0,M3>$E$5),LEFT(N2,MIN(M3-$E$5+3,LEN(N2))),N2)","v":"F3H3"},{"$f":"IF(AND($G3<>\"\",$G3>0,M3<$E$5),RIGHT(O2,MIN($E$5-M3,LEN(O2))),O2)","v":""},{"$f":"IFERROR(IF(AND(G3<>\"\",$G3<>$B$3),FIND(G3,$E$7),\"\"),\"\")","v":""},"B1",0,{"$f":"IF(P3<>\"\",OFFSET(Logik!$D$4,0,ROW()-1),0)","v":0},{"$f":"SUBSTITUTE(T2,G3,\"\")","v":"G2G3G4"}]
["PosX:",{"$f":"LEFT(B3,1)","v":"G"},null,"PosX",{"$f":"FIND(B3,E2)","v":1},{"$f":"Logik!G1","v":"C1"},"C1",false,"","G2G3G4","",false,"","F3H3","","","C1",0,{"$f":"IF(P4<>\"\",OFFSET(Logik!$D$4,0,ROW()-1),0)","v":0},{"$f":"SUBSTITUTE(T3,G4,\"\")","v":"G2G3G4"}]
["PosY:",{"$f":"RIGHT(B3,1)","v":"2"},null,"PosY",{"$f":"IFERROR(FIND(B3,E3),0)","v":0},{"$f":"Logik!H1","v":"D1"},"D1",false,"","G2G3G4","",false,"","F3H3","","","D1",0,{"$f":"IF(P5<>\"\",OFFSET(Logik!$D$4,0,ROW()-1),0)","v":0},"G2G3G4"]
[null,null,null,"RX",{"$f":"K33&J33","v":"G2G3G4"},{"$f":"Logik!I1","v":"E1"},"E1",false,"","G2G3G4","",false,"","F3H3","","","E1",0,{"$f":"IF(P6<>\"\",OFFSET(Logik!$D$4,0,ROW()-1),0)","v":0},"G2G3G4"]
["Poäng",{"$f":"Logik!S3","v":100},null,"RA",{"$f":"O33&N33","v":"F3H3"},{"$f":"Logik!J1","v":"F1"},"F1",false,"","G2G3G4","",false,"","F3H3","","","F1",0,{"$f":"IF(P7<>\"\",OFFSET(Logik!$D$4,0,ROW()-1),0)","v":0},"G2G3G4"]
["PosPoäng",{"$f":"Logik!S4","v":0},null,"RXY",{"$f":"E6&E7","v":"G2G3G4F3H3"},{"$f":"Logik!K1","v":"G1"},"G1",false,"","G2G3G4","",false,"","F3H3","","","G1",0,{"$f":"IF(P8<>\"\",OFFSET(Logik!$D$4,0,ROW()-1),0)","v":0},"G2G3G4"]
[null,null,null,"Försvar",{"$f":"SUM(R2:R17)+SUM(S2:S17)","v":0},{"$f":"Logik!L1","v":"H1"},"H1",false,"","G2G3G4","",false,"","F3H3","","","H1",0,{"$f":"IF(P9<>\"\",OFFSET(Logik!$D$4,0,ROW()-1),0)","v":0},"G2G3G4"]
[null,null,null,"Attack",{"$f":"SUM(R18:R33)+SUM(S18:S33)","v":0},{"$f":"Logik!M1","v":"A2"},"A2",false,"","G2G3G4","",false,"","F3H3","","","A2",0,{"$f":"IF(P10<>\"\",OFFSET(Logik!$D$4,0,ROW()-1),0)","v":0},"G2G3G4"]
[null,null,null,"R Antal",{"$f":"LEN(E8)/2","v":5},{"$f":"Logik!N1","v":"B2"},"B2",false,"","G2G3G4","",false,"","F3H3","","","B2",0,{"$f":"IF(P11<>\"\",OFFSET(Logik!$D$4,0,ROW()-1),0)","v":0},"G2G3G4"]
[null,null,null,null,null,{"$f":"Logik!O1","v":"C2"},"C2",false,"","G2G3G4","",false,"","F3H3","","","C2",0,{"$f":"IF(P12<>\"\",OFFSET(Logik!$D$4,0,ROW()-1),0)","v":0},"G2G3G4"]
[null,null,null,"MöjligaDrag",{"$f":"T33","v":"G3G4"},{"$f":"Logik!P1","v":"D2"},"D2",false,"","G2G3G4","",false,"","F3H3","","","D2",0,{"$f":"IF(P13<>\"\",OFFSET(Logik!$D$4,0,ROW()-1),0)","v":0},"G2G3G4"]
[null,null,null,"D Antal",{"$f":"LEN(E13)/2","v":2},{"$f":"Logik!Q1","v":"E2"},"E2",false,"","G2G3G4","",false,"","F3H3","","","E2",0,{"$f":"IF(P14<>\"\",OFFSET(Logik!$D$4,0,ROW()-1),0)","v":0},"G2G3G4"]
[null,null,null,null,null,{"$f":"Logik!R1","v":"F2"},"F2",false,"","G2G3G4","",false,"","F3H3","","","F2",0,{"$f":"IF(P15<>\"\",OFFSET(Logik!$D$4,0,ROW()-1),0)","v":0},"G2G3G4"]
[null,null,null,null,null,{"$f":"Logik!S1","v":"G2"},"G2",false,"","G2G3G4","",false,"","F3H3","","","G2",0,{"$f":"IF(P16<>\"\",OFFSET(Logik!$D$4,0,ROW()-1),0)","v":0},"G3G4"]
[null,null,null,null,null,{"$f":"Logik!T1","v":"H2"},"H2",false,"","G2G3G4","",false,"","F3H3","","","H2",0,{"$f":"IF(P17<>\"\",OFFSET(Logik!$D$4,0,ROW()-1),0)","v":0},"G3G4"]
[null,null,null,null,null,{"$f":"Logik!U1","v":"A7"},"A7",false,"","G2G3G4","",false,"","F3H3","","","A7",{"$f":"IF(P18<>\"\",HLOOKUP(HLOOKUP(Q18,PjasStart,2,FALSE),Pjaser,3,FALSE),0)","v":0},{"$f":"IF(P18<>\"\",OFFSET(Logik!$D$4,0,ROW()-1),0)","v":0},{"$f":"SUBSTITUTE(T17,G18,\"\")&IF(IFERROR(FIND(G18,N18)>0,FALSE),G18,\"\")","v":"G3G4"}]
[null,null,null,null,null,{"$f":"Logik!V1","v":"B7"},"B7",false,"","G2G3G4","",false,"","F3H3","","","B7",0,{"$f":"IF(P19<>\"\",OFFSET(Logik!$D$4,0,ROW()-1),0)","v":0},{"$f":"SUBSTITUTE(T18,G19,\"\")&IF(IFERROR(FIND(G19,N19)>0,FALSE),G19,\"\")","v":"G3G4"}]
[null,null,null,null,null,{"$f":"Logik!W1","v":"C7"},"C7",false,"","G2G3G4","",false,"","F3H3","","","C7",0,{"$f":"IF(P20<>\"\",OFFSET(Logik!$D$4,0,ROW()-1),0)","v":0},"G3G4"]
[null,null,null,null,null,{"$f":"Logik!X1","v":"D7"},"D7",false,"","G2G3G4","",false,"","F3H3","","","D7",0,{"$f":"IF(P21<>\"\",OFFSET(Logik!$D$4,0,ROW()-1),0)","v":0},"G3G4"]
[null,null,null,null,null,{"$f":"Logik!Y1","v":"E7"},"E7",false,"","G2G3G4","",false,"","F3H3","","","E7",0,{"$f":"IF(P22<>\"\",OFFSET(Logik!$D$4,0,ROW()-1),0)","v":0},"G3G4"]
[null,null,null,null,null,{"$f":"Logik!Z1","v":"F7"},"F7",false,"","G2G3G4","",false,"","F3H3","","","F7",0,{"$f":"IF(P23<>\"\",OFFSET(Logik!$D$4,0,ROW()-1),0)","v":0},"G3G4"]
[null,null,null,null,null,{"$f":"Logik!AA1","v":"G7"},"G7",false,"","G2G3G4","",false,"","F3H3","","","G7",0,{"$f":"IF(P24<>\"\",OFFSET(Logik!$D$4,0,ROW()-1),0)","v":0},"G3G4"]
[null,null,null,null,null,{"$f":"Logik!AB1","v":"H7"},"H7",false,"","G2G3G4","",false,"","F3H3","","","H7",0,{"$f":"IF(P25<>\"\",OFFSET(Logik!$D$4,0,ROW()-1),0)","v":0},"G3G4"]
[null,null,null,null,null,{"$f":"Logik!AC1","v":"A8"},"A8",false,"","G2G3G4","",false,"","F3H3","","","A8",0,{"$f":"IF(P26<>\"\",OFFSET(Logik!$D$4,0,ROW()-1),0)","v":0},"G3G4"]
[null,null,null,null,null,{"$f":"Logik!AD1","v":"B8"},"B8",false,"","G2G3G4","",false,"","F3H3","","","B8",0,{"$f":"IF(P27<>\"\",OFFSET(Logik!$D$4,0,ROW()-1),0)","v":0},"G3G4"]
[null,null,null,null,null,{"$f":"Logik!AE1","v":"C8"},"C8",false,"","G2G3G4","",false,"","F3H3","","","C8",0,{"$f":"IF(P28<>\"\",OFFSET(Logik!$D$4,0,ROW()-1),0)","v":0},"G3G4"]
[null,null,null,null,null,{"$f":"Logik!AF1","v":"D8"},"D8",false,"","G2G3G4","",false,"","F3H3","","","D8",0,{"$f":"IF(P29<>\"\",OFFSET(Logik!$D$4,0,ROW()-1),0)","v":0},"G3G4"]
[null,null,null,null,null,{"$f":"Logik!AG1","v":"E8"},"E8",false,"","G2G3G4","",false,"","F3H3","","","E8",0,{"$f":"IF(P30<>\"\",OFFSET(Logik!$D$4,0,ROW()-1),0)","v":0},"G3G4"]
[null,null,null,null,null,{"$f":"Logik!AH1","v":"F8"},"F8",false,"","G2G3G4","",false,"","F3H3","","","F8",0,{"$f":"IF(P31<>\"\",OFFSET(Logik!$D$4,0,ROW()-1),0)","v":0},"G3G4"]
[null,null,null,null,null,{"$f":"Logik!AI1","v":"G8"},{"$f":"UPPER(F32)","v":"G8"},false,"","G2G3G4","",false,"","F3H3","","","G8",0,{"$f":"IF(P32<>\"\",OFFSET(Logik!$D$4,0,ROW()-1),0)","v":0},"G3G4"]
[null,null,null,null,null,{"$f":"Logik!AJ1","v":"H8"},"H8",false,"","G2G3G4","",false,"","F3H3","","","H8",0,{"$f":"IF(P33<>\"\",OFFSET(Logik!$D$4,0,ROW()-1),0)","v":0},"G3G4"]

{"sheet":"P_H2","index":36,"n_rows":33,"n_cols":20,"rows_kept":33,"cut":false,"hidden":true,"merged":[]}
[null,null,null,null,null,{"$f":"Logik!D1","v":"Pos:"},"Pjäs:","Fräckvidd","Pos",{"$f":"RIGHT($E$2,LEN($E$2)-$E$4+1)","v":"H2H3H4"},{"$f":"LEFT($E$2,$E$4-1)","v":""},"Aräckvidd",null,{"$f":"RIGHT($E$3,LEN($E$3)-$E$5+1)","v":"G3"},{"$f":"IF(E5=0,\"\",(LEFT($E$3,$E$5-1)))","v":""},"Nåbar","Vad","Poäng","PosPoäng","MöjligaDrag"]
["Pjäs:",{"$f":"Logik!T2","v":"H2"},null,"FRäckvidd",{"$f":"IFERROR(INDEX(tblRVB,MATCH(\"VB\"&$B$3,RVB!$A$2:$A$120,0),5),\"\")","v":"H2H3H4"},{"$f":"UPPER(Logik!E1)","v":"A1"},{"$f":"UPPER(F2)","v":"A1"},{"$f":"IF($G2<>\"\",IF($G2<>$B$3,IF(IFERROR(FIND($G2,$E$2)>0,FALSE),TRUE,FALSE),FALSE),FALSE)","v":false},{"$f":"IF(H2,FIND($G2,$E$2),\"\")","v":""},{"$f":"IF(AND(I2<>\"\",I2>0,I2>$E$4),LEFT(J1,MIN(I2-$E$4+2,LEN(J1))),J1)","v":"H2H3H4"},{"$f":"IF(AND($G2<>\"\",$G2>0,$I2<$E$4),RIGHT(K1,MIN($E$4-$I2,LEN(K1))),K1)","v":""},{"$f":"IF($G2<>\"\",IF($G2<>$B$3,IF(IFERROR(FIND($G2,$E$3)>0,FALSE),TRUE,FALSE),FALSE),FALSE)","v":false},{"$f":"IF(L2,FIND($G2,$E$3),\"\")","v":""},{"$f":"IF(AND(M2<>\"\",M2>0,M2>$E$5),LEFT(N1,MIN(M2-$E$5+3,LEN(N1))),N1)","v":"G3"},{"$f":"IF(AND($G2<>\"\",$G2>0,M2<$E$5),RIGHT(O1,MIN($E$5-M2,LEN(O1))),O1)","v":""},{"$f":"IFERROR(IF(AND(G2<>\"\",$G2<>$B$3),FIND(G2,$E$7),\"\"),\"\")","v":""},"A1",{"$f":"IF(P2<>\"\",HLOOKUP(HLOOKUP(Q2,PjasStart,2,FALSE),Pjaser,4,FALSE),0)","v":0},{"$f":"IF(P2<>\"\",OFFSET(Logik!$D$4,0,ROW()-1),0)","v":0},{"$f":"SUBSTITUTE(E6,G2,\"\")","v":"H2H3H4"}]
["Pos:",{"$f":"UPPER(Logik!T1)","v":"H2"},null,"Aräckvidd",{"$f":"IFERROR(INDEX(tblRVB,MATCH(\"VB\"&$B$3,RVB!$A$2:$A$120,0),6),\"\")","v":"G3"},{"$f":"Logik!F1","v":"B1"},{"$f":"UPPER(F3)","v":"B1"},{"$f":"IF($G3<>\"\",IF($G3<>$B$3,IF(IFERROR(FIND($G3,$E$2)>0,FALSE),TRUE,FALSE),FALSE),FALSE)","v":false},{"$f":"IF(H3,FIND($G3,$E$2),\"\")","v":""},{"$f":"IF(AND(I3<>\"\",I3>0,I3>$E$4),LEFT(J2,MIN(I3-$E$4+2,LEN(J2))),J2)","v":"H2H3H4"},{"$f":"IF(AND($G3<>\"\",$G3>0,$I3<$E$4),RIGHT(K2,MIN($E$4-$I3,LEN(K2))),K2)","v":""},{"$f":"IF($G3<>\"\",IF($G3<>$B$3,IF(IFERROR(FIND($G3,$E$3)>0,FALSE),TRUE,FALSE),FALSE),FALSE)","v":false},{"$f":"IF(L3,FIND($G3,$E$3),\"\")","v":""},{"$f":"IF(AND(M3<>\"\",M3>0,M3>$E$5),LEFT(N2,MIN(M3-$E$5+3,LEN(N2))),N2)","v":"G3"},{"$f":"IF(AND($G3<>\"\",$G3>0,M3<$E$5),RIGHT(O2,MIN($E$5-M3,LEN(O2))),O2)","v":""},{"$f":"IFERROR(IF(AND(G3<>\"\",$G3<>$B$3),FIND(G3,$E$7),\"\"),\"\")","v":""},"B1",0,{"$f":"IF(P3<>\"\",OFFSET(Logik!$D$4,0,ROW()-1),0)","v":0},{"$f":"SUBSTITUTE(T2,G3,\"\")","v":"H2H3H4"}]
["PosX:",{"$f":"LEFT(B3,1)","v":"H"},null,"PosX",{"$f":"FIND(B3,E2)","v":1},{"$f":"Logik!G1","v":"C1"},"C1",false,"","H2H3H4","",false,"","G3","","","C1",0,{"$f":"IF(P4<>\"\",OFFSET(Logik!$D$4,0,ROW()-1),0)","v":0},{"$f":"SUBSTITUTE(T3,G4,\"\")","v":"H2H3H4"}]
["PosY:",{"$f":"RIGHT(B3,1)","v":"2"},null,"PosY",{"$f":"IFERROR(FIND(B3,E3),0)","v":0},{"$f":"Logik!H1","v":"D1"},"D1",false,"","H2H3H4","",false,"","G3","","","D1",0,{"$f":"IF(P5<>\"\",OFFSET(Logik!$D$4,0,ROW()-1),0)","v":0},"H2H3H4"]
[null,null,null,"RX",{"$f":"K33&J33","v":"H2H3H4"},{"$f":"Logik!I1","v":"E1"},"E1",false,"","H2H3H4","",false,"","G3","","","E1",0,{"$f":"IF(P6<>\"\",OFFSET(Logik!$D$4,0,ROW()-1),0)","v":0},"H2H3H4"]
["Poäng",{"$f":"Logik!T3","v":100},null,"RA",{"$f":"O33&N33","v":"G3"},{"$f":"Logik!J1","v":"F1"},"F1",false,"","H2H3H4","",false,"","G3","","","F1",0,{"$f":"IF(P7<>\"\",OFFSET(Logik!$D$4,0,ROW()-1),0)","v":0},"H2H3H4"]
["PosPoäng",{"$f":"Logik!T4","v":0},null,"RXY",{"$f":"E6&E7","v":"H2H3H4G3"},{"$f":"Logik!K1","v":"G1"},"G1",false,"","H2H3H4","",false,"","G3","","","G1",0,{"$f":"IF(P8<>\"\",OFFSET(Logik!$D$4,0,ROW()-1),0)","v":0},"H2H3H4"]
[null,null,null,"Försvar",{"$f":"SUM(R2:R17)+SUM(S2:S17)","v":0},{"$f":"Logik!L1","v":"H1"},"H1",false,"","H2H3H4","",false,"","G3","","","H1",0,{"$f":"IF(P9<>\"\",OFFSET(Logik!$D$4,0,ROW()-1),0)","v":0},"H2H3H4"]
[null,null,null,"Attack",{"$f":"SUM(R18:R33)+SUM(S18:S33)","v":0},{"$f":"Logik!M1","v":"A2"},"A2",false,"","H2H3H4","",false,"","G3","","","A2",0,{"$f":"IF(P10<>\"\",OFFSET(Logik!$D$4,0,ROW()-1),0)","v":0},"H2H3H4"]
[null,null,null,"R Antal",{"$f":"LEN(E8)/2","v":4},{"$f":"Logik!N1","v":"B2"},"B2",false,"","H2H3H4","",false,"","G3","","","B2",0,{"$f":"IF(P11<>\"\",OFFSET(Logik!$D$4,0,ROW()-1),0)","v":0},"H2H3H4"]
[null,null,null,null,null,{"$f":"Logik!O1","v":"C2"},"C2",false,"","H2H3H4","",false,"","G3","","","C2",0,{"$f":"IF(P12<>\"\",OFFSET(Logik!$D$4,0,ROW()-1),0)","v":0},"H2H3H4"]
[null,null,null,"MöjligaDrag",{"$f":"T33","v":"H3H4"},{"$f":"Logik!P1","v":"D2"},"D2",false,"","H2H3H4","",false,"","G3","","","D2",0,{"$f":"IF(P13<>\"\",OFFSET(Logik!$D$4,0,ROW()-1),0)","v":0},"H2H3H4"]
[null,null,null,"D Antal",{"$f":"LEN(E13)/2","v":2},{"$f":"Logik!Q1","v":"E2"},"E2",false,"","H2H3H4","",false,"","G3","","","E2",0,{"$f":"IF(P14<>\"\",OFFSET(Logik!$D$4,0,ROW()-1),0)","v":0},"H2H3H4"]
[null,null,null,null,null,{"$f":"Logik!R1","v":"F2"},"F2",false,"","H2H3H4","",false,"","G3","","","F2",0,{"$f":"IF(P15<>\"\",OFFSET(Logik!$D$4,0,ROW()-1),0)","v":0},"H2H3H4"]
[null,null,null,null,null,{"$f":"Logik!S1","v":"G2"},"G2",false,"","H2H3H4","",false,"","G3","","","G2",0,{"$f":"IF(P16<>\"\",OFFSET(Logik!$D$4,0,ROW()-1),0)","v":0},"H2H3H4"]
[null,null,null,null,null,{"$f":"Logik!T1","v":"H2"},"H2",false,"","H2H3H4","",false,"","G3","","","H2",0,{"$f":"IF(P17<>\"\",OFFSET(Logik!$D$4,0,ROW()-1),0)","v":0},"H3H4"]
[null,null,null,null,null,{"$f":"Logik!U1","v":"A7"},"A7",false,"","H2H3H4","",false,"","G3","","","A7",{"$f":"IF(P18<>\"\",HLOOKUP(HLOOKUP(Q18,PjasStart,2,FALSE),Pjaser,3,FALSE),0)","v":0},{"$f":"IF(P18<>\"\",OFFSET(Logik!$D$4,0,ROW()-1),0)","v":0},{"$f":"SUBSTITUTE(T17,G18,\"\")&IF(IFERROR(FIND(G18,N18)>0,FALSE),G18,\"\")","v":"H3H4"}]
[null,null,null,null,null,{"$f":"Logik!V1","v":"B7"},"B7",false,"","H2H3H4","",false,"","G3","","","B7",0,{"$f":"IF(P19<>\"\",OFFSET(Logik!$D$4,0,ROW()-1),0)","v":0},{"$f":"SUBSTITUTE(T18,G19,\"\")&IF(IFERROR(FIND(G19,N19)>0,FALSE),G19,\"\")","v":"H3H4"}]
[null,null,null,null,null,{"$f":"Logik!W1","v":"C7"},"C7",false,"","H2H3H4","",false,"","G3","","","C7",0,{"$f":"IF(P20<>\"\",OFFSET(Logik!$D$4,0,ROW()-1),0)","v":0},"H3H4"]
[null,null,null,null,null,{"$f":"Logik!X1","v":"D7"},"D7",false,"","H2H3H4","",false,"","G3","","","D7",0,{"$f":"IF(P21<>\"\",OFFSET(Logik!$D$4,0,ROW()-1),0)","v":0},"H3H4"]
[null,null,null,null,null,{"$f":"Logik!Y1","v":"E7"},"E7",false,"","H2H3H4","",false,"","G3","","","E7",0,{"$f":"IF(P22<>\"\",OFFSET(Logik!$D$4,0,ROW()-1),0)","v":0},"H3H4"]
[null,null,null,null,null,{"$f":"Logik!Z1","v":"F7"},"F7",false,"","H2H3H4","",false,"","G3","","","F7",0,{"$f":"IF(P23<>\"\",OFFSET(Logik!$D$4,0,ROW()-1),0)","v":0},"H3H4"]
[null,null,null,null,null,{"$f":"Logik!AA1","v":"G7"},"G7",false,"","H2H3H4","",false,"","G3","","","G7",0,{"$f":"IF(P24<>\"\",OFFSET(Logik!$D$4,0,ROW()-1),0)","v":0},"H3H4"]
[null,null,null,null,null,{"$f":"Logik!AB1","v":"H7"},"H7",false,"","H2H3H4","",false,"","G3","","","H7",0,{"$f":"IF(P25<>\"\",OFFSET(Logik!$D$4,0,ROW()-1),0)","v":0},"H3H4"]
[null,null,null,null,null,{"$f":"Logik!AC1","v":"A8"},"A8",false,"","H2H3H4","",false,"","G3","","","A8",0,{"$f":"IF(P26<>\"\",OFFSET(Logik!$D$4,0,ROW()-1),0)","v":0},"H3H4"]
[null,null,null,null,null,{"$f":"Logik!AD1","v":"B8"},"B8",false,"","H2H3H4","",false,"","G3","","","B8",0,{"$f":"IF(P27<>\"\",OFFSET(Logik!$D$4,0,ROW()-1),0)","v":0},"H3H4"]
[null,null,null,null,null,{"$f":"Logik!AE1","v":"C8"},"C8",false,"","H2H3H4","",false,"","G3","","","C8",0,{"$f":"IF(P28<>\"\",OFFSET(Logik!$D$4,0,ROW()-1),0)","v":0},"H3H4"]
[null,null,null,null,null,{"$f":"Logik!AF1","v":"D8"},"D8",false,"","H2H3H4","",false,"","G3","","","D8",0,{"$f":"IF(P29<>\"\",OFFSET(Logik!$D$4,0,ROW()-1),0)","v":0},"H3H4"]
[null,null,null,null,null,{"$f":"Logik!AG1","v":"E8"},"E8",false,"","H2H3H4","",false,"","G3","","","E8",0,{"$f":"IF(P30<>\"\",OFFSET(Logik!$D$4,0,ROW()-1),0)","v":0},"H3H4"]
[null,null,null,null,null,{"$f":"Logik!AH1","v":"F8"},"F8",false,"","H2H3H4","",false,"","G3","","","F8",0,{"$f":"IF(P31<>\"\",OFFSET(Logik!$D$4,0,ROW()-1),0)","v":0},"H3H4"]
[null,null,null,null,null,{"$f":"Logik!AI1","v":"G8"},"G8",false,"","H2H3H4","",false,"","G3","","","G8",0,{"$f":"IF(P32<>\"\",OFFSET(Logik!$D$4,0,ROW()-1),0)","v":0},"H3H4"]
[null,null,null,null,null,{"$f":"Logik!AJ1","v":"H8"},"H8",false,"","H2H3H4","",false,"","G3","","","H8",0,{"$f":"IF(P33<>\"\",OFFSET(Logik!$D$4,0,ROW()-1),0)","v":0},"H3H4"]

{"sheet":"P_A7","index":37,"n_rows":33,"n_cols":20,"rows_kept":33,"cut":false,"hidden":true,"merged":[]}
[null,null,null,null,null,{"$f":"Logik!D1","v":"Pos:"},"Pjäs:","Fräckvidd","Pos",{"$f":"RIGHT($E$2,LEN($E$2)-$E$4+1)","v":"A7A6A5"},{"$f":"LEFT($E$2,$E$4-1)","v":""},"Aräckvidd",null,{"$f":"RIGHT($E$3,LEN($E$3)-$E$5+1)","v":"B6"},{"$f":"IF(E5=0,\"\",(LEFT($E$3,$E$5-1)))","v":""},"Nåbar","Vad","Poäng","PosPoäng","MöjligaDrag"]
["Pjäs:",{"$f":"Logik!U2","v":"A7"},null,"FRäckvidd",{"$f":"IFERROR(INDEX(tblRVB,MATCH(\"SB\"&$B$3,RVB!$A$2:$A$120,0),5),\"\")","v":"A7A6A5"},{"$f":"UPPER(Logik!E1)","v":"A1"},{"$f":"UPPER(F2)","v":"A1"},{"$f":"IF($G2<>\"\",IF($G2<>$B$3,IF(IFERROR(FIND($G2,$E$2)>0,FALSE),TRUE,FALSE),FALSE),FALSE)","v":false},{"$f":"IF(H2,FIND($G2,$E$2),\"\")","v":""},{"$f":"IF(AND(I2<>\"\",I2>0,I2>$E$4),LEFT(J1,MIN(I2-$E$4+2,LEN(J1))),J1)","v":"A7A6A5"},{"$f":"IF(AND($G2<>\"\",$G2>0,$I2<$E$4),RIGHT(K1,MIN($E$4-$I2,LEN(K1))),K1)","v":""},{"$f":"IF($G2<>\"\",IF($G2<>$B$3,IF(IFERROR(FIND($G2,$E$3)>0,FALSE),TRUE,FALSE),FALSE),FALSE)","v":false},{"$f":"IF(L2,FIND($G2,$E$3),\"\")","v":""},{"$f":"IF(AND(M2<>\"\",M2>0,M2>$E$5),LEFT(N1,MIN(M2-$E$5+3,LEN(N1))),N1)","v":"B6"},{"$f":"IF(AND($G2<>\"\",$G2>0,M2<$E$5),RIGHT(O1,MIN($E$5-M2,LEN(O1))),O1)","v":""},{"$f":"IFERROR(IF(AND(G2<>\"\",$G2<>$B$3),FIND(G2,$E$7),\"\"),\"\")","v":""},"A1",{"$f":"IF(P2<>\"\",HLOOKUP(HLOOKUP(Q2,PjasStart,2,FALSE),Pjaser,3,FALSE),0)","v":0},{"$f":"IF(P2<>\"\",OFFSET(Logik!$D$4,0,ROW()-1),0)","v":0},{"$f":"SUBSTITUTE(E6,G2,\"\")&IF(IFERROR(FIND(G2,N2)>0,FALSE),G2,\"\")","v":"A7A6A5"}]
["Pos:",{"$f":"UPPER(Logik!U1)","v":"A7"},null,"Aräckvidd",{"$f":"IFERROR(INDEX(tblRVB,MATCH(\"SB\"&$B$3,RVB!$A$2:$A$120,0),6),\"\")","v":"B6"},{"$f":"Logik!F1","v":"B1"},{"$f":"UPPER(F3)","v":"B1"},{"$f":"IF($G3<>\"\",IF($G3<>$B$3,IF(IFERROR(FIND($G3,$E$2)>0,FALSE),TRUE,FALSE),FALSE),FALSE)","v":false},{"$f":"IF(H3,FIND($G3,$E$2),\"\")","v":""},{"$f":"IF(AND(I3<>\"\",I3>0,I3>$E$4),LEFT(J2,MIN(I3-$E$4+2,LEN(J2))),J2)","v":"A7A6A5"},{"$f":"IF(AND($G3<>\"\",$G3>0,$I3<$E$4),RIGHT(K2,MIN($E$4-$I3,LEN(K2))),K2)","v":""},{"$f":"IF($G3<>\"\",IF($G3<>$B$3,IF(IFERROR(FIND($G3,$E$3)>0,FALSE),TRUE,FALSE),FALSE),FALSE)","v":false},{"$f":"IF(L3,FIND($G3,$E$3),\"\")","v":""},{"$f":"IF(AND(M3<>\"\",M3>0,M3>$E$5),LEFT(N2,MIN(M3-$E$5+3,LEN(N2))),N2)","v":"B6"},{"$f":"IF(AND($G3<>\"\",$G3>0,M3<$E$5),RIGHT(O2,MIN($E$5-M3,LEN(O2))),O2)","v":""},{"$f":"IFERROR(IF(AND(G3<>\"\",$G3<>$B$3),FIND(G3,$E$7),\"\"),\"\")","v":""},"B1",0,{"$f":"IF(P3<>\"\",OFFSET(Logik!$D$4,0,ROW()-1),0)","v":0},{"$f":"SUBSTITUTE(T2,G3,\"\")&IF(IFERROR(FIND(G3,N3)>0,FALSE),G3,\"\")","v":"A7A6A5"}]
["PosX:",{"$f":"LEFT(B3,1)","v":"A"},null,"PosX",{"$f":"FIND(B3,E2)","v":1},{"$f":"Logik!G1","v":"C1"},"C1",false,"","A7A6A5","",false,"","B6","","","C1",0,{"$f":"IF(P4<>\"\",OFFSET(Logik!$D$4,0,ROW()-1),0)","v":0},{"$f":"SUBSTITUTE(T3,G4,\"\")&IF(IFERROR(FIND(G4,N4)>0,FALSE),G4,\"\")","v":"A7A6A5"}]
["PosY:",{"$f":"RIGHT(B3,1)","v":"7"},null,"PosY",{"$f":"IFERROR(FIND(B3,E3),0)","v":0},{"$f":"Logik!H1","v":"D1"},"D1",false,"","A7A6A5","",false,"","B6","","","D1",0,{"$f":"IF(P5<>\"\",OFFSET(Logik!$D$4,0,ROW()-1),0)","v":0},"A7A6A5"]
[null,null,null,"RX",{"$f":"K33&J33","v":"A7A6A5"},{"$f":"Logik!I1","v":"E1"},"E1",false,"","A7A6A5","",false,"","B6","","","E1",0,{"$f":"IF(P6<>\"\",OFFSET(Logik!$D$4,0,ROW()-1),0)","v":0},"A7A6A5"]
["Poäng",{"$f":"Logik!U3","v":100},null,"RA",{"$f":"O33&N33","v":"B6"},{"$f":"Logik!J1","v":"F1"},"F1",false,"","A7A6A5","",false,"","B6","","","F1",0,{"$f":"IF(P7<>\"\",OFFSET(Logik!$D$4,0,ROW()-1),0)","v":0},"A7A6A5"]
["PosPoäng",{"$f":"Logik!U4","v":0},null,"RXY",{"$f":"E6&E7","v":"A7A6A5B6"},{"$f":"Logik!K1","v":"G1"},"G1",false,"","A7A6A5","",false,"","B6","","","G1",0,{"$f":"IF(P8<>\"\",OFFSET(Logik!$D$4,0,ROW()-1),0)","v":0},"A7A6A5"]
[null,null,null,"Försvar",{"$f":"SUM(R18:R33)+SUM(S18:S33)","v":0},{"$f":"Logik!L1","v":"H1"},"H1",false,"","A7A6A5","",false,"","B6","","","H1",0,{"$f":"IF(P9<>\"\",OFFSET(Logik!$D$4,0,ROW()-1),0)","v":0},"A7A6A5"]
[null,null,null,"Attack",{"$f":"SUM(R2:R17)+SUM(S2:S17)","v":0},{"$f":"Logik!M1","v":"A2"},"A2",false,"","A7A6A5","",false,"","B6","","","A2",0,{"$f":"IF(P10<>\"\",OFFSET(Logik!$D$4,0,ROW()-1),0)","v":0},"A7A6A5"]
[null,null,null,"R Antal",{"$f":"LEN(E8)/2","v":4},{"$f":"Logik!N1","v":"B2"},"B2",false,"","A7A6A5","",false,"","B6","","","B2",0,{"$f":"IF(P11<>\"\",OFFSET(Logik!$D$4,0,ROW()-1),0)","v":0},"A7A6A5"]
[null,null,null,null,null,{"$f":"Logik!O1","v":"C2"},"C2",false,"","A7A6A5","",false,"","B6","","","C2",0,{"$f":"IF(P12<>\"\",OFFSET(Logik!$D$4,0,ROW()-1),0)","v":0},"A7A6A5"]
[null,null,null,"MöjligaDrag",{"$f":"T33","v":"A6A5"},{"$f":"Logik!P1","v":"D2"},"D2",false,"","A7A6A5","",false,"","B6","","","D2",0,{"$f":"IF(P13<>\"\",OFFSET(Logik!$D$4,0,ROW()-1),0)","v":0},"A7A6A5"]
[null,null,null,"D Antal",{"$f":"LEN(E13)/2","v":2},{"$f":"Logik!Q1","v":"E2"},"E2",false,"","A7A6A5","",false,"","B6","","","E2",0,{"$f":"IF(P14<>\"\",OFFSET(Logik!$D$4,0,ROW()-1),0)","v":0},"A7A6A5"]
[null,null,null,null,null,{"$f":"Logik!R1","v":"F2"},"F2",false,"","A7A6A5","",false,"","B6","","","F2",0,{"$f":"IF(P15<>\"\",OFFSET(Logik!$D$4,0,ROW()-1),0)","v":0},"A7A6A5"]
[null,null,null,null,null,{"$f":"Logik!S1","v":"G2"},"G2",false,"","A7A6A5","",false,"","B6","","","G2",0,{"$f":"IF(P16<>\"\",OFFSET(Logik!$D$4,0,ROW()-1),0)","v":0},"A7A6A5"]
[null,null,null,null,null,{"$f":"Logik!T1","v":"H2"},"H2",false,"","A7A6A5","",false,"","B6","","","H2",0,{"$f":"IF(P17<>\"\",OFFSET(Logik!$D$4,0,ROW()-1),0)","v":0},"A7A6A5"]
[null,null,null,null,null,{"$f":"Logik!U1","v":"A7"},"A7",false,"","A7A6A5","",false,"","B6","","","A7",{"$f":"IF(P18<>\"\",HLOOKUP(HLOOKUP(Q18,PjasStart,2,FALSE),Pjaser,4,FALSE),0)","v":0},{"$f":"IF(P18<>\"\",OFFSET(Logik!$D$4,0,ROW()-1),0)","v":0},{"$f":"SUBSTITUTE(T17,G18,\"\")","v":"A6A5"}]
[null,null,null,null,null,{"$f":"Logik!V1","v":"B7"},"B7",false,"","A7A6A5","",false,"","B6","","","B7",0,{"$f":"IF(P19<>\"\",OFFSET(Logik!$D$4,0,ROW()-1),0)","v":0},{"$f":"SUBSTITUTE(T18,G19,\"\")","v":"A6A5"}]
[null,null,null,null,null,{"$f":"Logik!W1","v":"C7"},"C7",false,"","A7A6A5","",false,"","B6","","","C7",0,{"$f":"IF(P20<>\"\",OFFSET(Logik!$D$4,0,ROW()-1),0)","v":0},{"$f":"SUBSTITUTE(T19,G20,\"\")","v":"A6A5"}]
[null,null,null,null,null,{"$f":"Logik!X1","v":"D7"},"D7",false,"","A7A6A5","",false,"","B6","","","D7",0,{"$f":"IF(P21<>\"\",OFFSET(Logik!$D$4,0,ROW()-1),0)","v":0},"A6A5"]
[null,null,null,null,null,{"$f":"Logik!Y1","v":"E7"},"E7",false,"","A7A6A5","",false,"","B6","","","E7",0,{"$f":"IF(P22<>\"\",OFFSET(Logik!$D$4,0,ROW()-1),0)","v":0},"A6A5"]
[null,null,null,null,null,{"$f":"Logik!Z1","v":"F7"},"F7",false,"","A7A6A5","",false,"","B6","","","F7",0,{"$f":"IF(P23<>\"\",OFFSET(Logik!$D$4,0,ROW()-1),0)","v":0},"A6A5"]
[null,null,null,null,null,{"$f":"Logik!AA1","v":"G7"},"G7",false,"","A7A6A5","",false,"","B6","","","G7",0,{"$f":"IF(P24<>\"\",OFFSET(Logik!$D$4,0,ROW()-1),0)","v":0},"A6A5"]
[null,null,null,null,null,{"$f":"Logik!AB1","v":"H7"},"H7",false,"","A7A6A5","",false,"","B6","","","H7",0,{"$f":"IF(P25<>\"\",OFFSET(Logik!$D$4,0,ROW()-1),0)","v":0},"A6A5"]
[null,null,null,null,null,{"$f":"Logik!AC1","v":"A8"},"A8",false,"","A7A6A5","",false,"","B6","","","A8",0,{"$f":"IF(P26<>\"\",OFFSET(Logik!$D$4,0,ROW()-1),0)","v":0},"A6A5"]
[null,null,null,null,null,{"$f":"Logik!AD1","v":"B8"},"B8",false,"","A7A6A5","",false,"","B6","","","B8",0,{"$f":"IF(P27<>\"\",OFFSET(Logik!$D$4,0,ROW()-1),0)","v":0},"A6A5"]
[null,null,null,null,null,{"$f":"Logik!AE1","v":"C8"},"C8",false,"","A7A6A5","",false,"","B6","","","C8",0,{"$f":"IF(P28<>\"\",OFFSET(Logik!$D$4,0,ROW()-1),0)","v":0},"A6A5"]
[null,null,null,null,null,{"$f":"Logik!AF1","v":"D8"},"D8",false,"","A7A6A5","",false,"","B6","","","D8",0,{"$f":"IF(P29<>\"\",OFFSET(Logik!$D$4,0,ROW()-1),0)","v":0},"A6A5"]
[null,null,null,null,null,{"$f":"Logik!AG1","v":"E8"},"E8",false,"","A7A6A5","",false,"","B6","","","E8",0,{"$f":"IF(P30<>\"\",OFFSET(Logik!$D$4,0,ROW()-1),0)","v":0},"A6A5"]
[null,null,null,null,null,{"$f":"Logik!AH1","v":"F8"},"F8",false,"","A7A6A5","",false,"","B6","","","F8",0,{"$f":"IF(P31<>\"\",OFFSET(Logik!$D$4,0,ROW()-1),0)","v":0},"A6A5"]
[null,null,null,null,null,{"$f":"Logik!AI1","v":"G8"},"G8",false,"","A7A6A5","",false,"","B6","","","G8",0,{"$f":"IF(P32<>\"\",OFFSET(Logik!$D$4,0,ROW()-1),0)","v":0},"A6A5"]
[null,null,null,null,null,{"$f":"Logik!AJ1","v":"H8"},"H8",false,"","A7A6A5","",false,"","B6","","","H8",0,{"$f":"IF(P33<>\"\",OFFSET(Logik!$D$4,0,ROW()-1),0)","v":0},"A6A5"]

{"sheet":"P_B7","index":38,"n_rows":33,"n_cols":20,"rows_kept":33,"cut":false,"hidden":true,"merged":[]}
[null,null,null,null,null,{"$f":"Logik!D1","v":"Pos:"},"Pjäs:","Fräckvidd","Pos",{"$f":"RIGHT($E$2,LEN($E$2)-$E$4+1)","v":"B7B6B5"},{"$f":"LEFT($E$2,$E$4-1)","v":""},"Aräckvidd",null,{"$f":"RIGHT($E$3,LEN($E$3)-$E$5+1)","v":"A6C6"},{"$f":"IF(E5=0,\"\",(LEFT($E$3,$E$5-1)))","v":""},"Nåbar","Vad","Poäng","PosPoäng","MöjligaDrag"]
["Pjäs:",{"$f":"Logik!V2","v":"B7"},null,"FRäckvidd",{"$f":"IFERROR(INDEX(tblRVB,MATCH(\"SB\"&$B$3,RVB!$A$2:$A$120,0),5),\"\")","v":"B7B6B5"},{"$f":"UPPER(Logik!E1)","v":"A1"},{"$f":"UPPER(F2)","v":"A1"},{"$f":"IF($G2<>\"\",IF($G2<>$B$3,IF(IFERROR(FIND($G2,$E$2)>0,FALSE),TRUE,FALSE),FALSE),FALSE)","v":false},{"$f":"IF(H2,FIND($G2,$E$2),\"\")","v":""},{"$f":"IF(AND(I2<>\"\",I2>0,I2>$E$4),LEFT(J1,MIN(I2-$E$4+2,LEN(J1))),J1)","v":"B7B6B5"},{"$f":"IF(AND($G2<>\"\",$G2>0,$I2<$E$4),RIGHT(K1,MIN($E$4-$I2,LEN(K1))),K1)","v":""},{"$f":"IF($G2<>\"\",IF($G2<>$B$3,IF(IFERROR(FIND($G2,$E$3)>0,FALSE),TRUE,FALSE),FALSE),FALSE)","v":false},{"$f":"IF(L2,FIND($G2,$E$3),\"\")","v":""},{"$f":"IF(AND(M2<>\"\",M2>0,M2>$E$5),LEFT(N1,MIN(M2-$E$5+3,LEN(N1))),N1)","v":"A6C6"},{"$f":"IF(AND($G2<>\"\",$G2>0,M2<$E$5),RIGHT(O1,MIN($E$5-M2,LEN(O1))),O1)","v":""},{"$f":"IFERROR(IF(AND(G2<>\"\",$G2<>$B$3),FIND(G2,$E$7),\"\"),\"\")","v":""},"A1",{"$f":"IF(P2<>\"\",HLOOKUP(HLOOKUP(Q2,PjasStart,2,FALSE),Pjaser,3,FALSE),0)","v":0},{"$f":"IF(P2<>\"\",OFFSET(Logik!$D$4,0,ROW()-1),0)","v":0},{"$f":"SUBSTITUTE(E6,G2,\"\")&IF(IFERROR(FIND(G2,N2)>0,FALSE),G2,\"\")","v":"B7B6B5"}]
["Pos:",{"$f":"UPPER(Logik!V1)","v":"B7"},null,"Aräckvidd",{"$f":"IFERROR(INDEX(tblRVB,MATCH(\"SB\"&$B$3,RVB!$A$2:$A$120,0),6),\"\")","v":"A6C6"},{"$f":"Logik!F1","v":"B1"},{"$f":"UPPER(F3)","v":"B1"},{"$f":"IF($G3<>\"\",IF($G3<>$B$3,IF(IFERROR(FIND($G3,$E$2)>0,FALSE),TRUE,FALSE),FALSE),FALSE)","v":false},{"$f":"IF(H3,FIND($G3,$E$2),\"\")","v":""},{"$f":"IF(AND(I3<>\"\",I3>0,I3>$E$4),LEFT(J2,MIN(I3-$E$4+2,LEN(J2))),J2)","v":"B7B6B5"},{"$f":"IF(AND($G3<>\"\",$G3>0,$I3<$E$4),RIGHT(K2,MIN($E$4-$I3,LEN(K2))),K2)","v":""},{"$f":"IF($G3<>\"\",IF($G3<>$B$3,IF(IFERROR(FIND($G3,$E$3)>0,FALSE),TRUE,FALSE),FALSE),FALSE)","v":false},{"$f":"IF(L3,FIND($G3,$E$3),\"\")","v":""},{"$f":"IF(AND(M3<>\"\",M3>0,M3>$E$5),LEFT(N2,MIN(M3-$E$5+3,LEN(N2))),N2)","v":"A6C6"},{"$f":"IF(AND($G3<>\"\",$G3>0,M3<$E$5),RIGHT(O2,MIN($E$5-M3,LEN(O2))),O2)","v":""},{"$f":"IFERROR(IF(AND(G3<>\"\",$G3<>$B$3),FIND(G3,$E$7),\"\"),\"\")","v":""},"B1",0,{"$f":"IF(P3<>\"\",OFFSET(Logik!$D$4,0,ROW()-1),0)","v":0},{"$f":"SUBSTITUTE(T2,G3,\"\")&IF(IFERROR(FIND(G3,N3)>0,FALSE),G3,\"\")","v":"B7B6B5"}]
["PosX:",{"$f":"LEFT(B3,1)","v":"B"},null,"PosX",{"$f":"FIND(B3,E2)","v":1},{"$f":"Logik!G1","v":"C1"},"C1",false,"","B7B6B5","",false,"","A6C6","","","C1",0,{"$f":"IF(P4<>\"\",OFFSET(Logik!$D$4,0,ROW()-1),0)","v":0},{"$f":"SUBSTITUTE(T3,G4,\"\")&IF(IFERROR(FIND(G4,N4)>0,FALSE),G4,\"\")","v":"B7B6B5"}]
["PosY:",{"$f":"RIGHT(B3,1)","v":"7"},null,"PosY",{"$f":"IFERROR(FIND(B3,E3),0)","v":0},{"$f":"Logik!H1","v":"D1"},"D1",false,"","B7B6B5","",false,"","A6C6","","","D1",0,{"$f":"IF(P5<>\"\",OFFSET(Logik!$D$4,0,ROW()-1),0)","v":0},"B7B6B5"]
[null,null,null,"RX",{"$f":"K33&J33","v":"B7B6B5"},{"$f":"Logik!I1","v":"E1"},"E1",false,"","B7B6B5","",false,"","A6C6","","","E1",0,{"$f":"IF(P6<>\"\",OFFSET(Logik!$D$4,0,ROW()-1),0)","v":0},"B7B6B5"]
["Poäng",{"$f":"Logik!V3","v":100},null,"RA",{"$f":"O33&N33","v":"A6C6"},{"$f":"Logik!J1","v":"F1"},"F1",false,"","B7B6B5","",false,"","A6C6","","","F1",0,{"$f":"IF(P7<>\"\",OFFSET(Logik!$D$4,0,ROW()-1),0)","v":0},"B7B6B5"]
["PosPoäng",{"$f":"Logik!V4","v":0},null,"RXY",{"$f":"E6&E7","v":"B7B6B5A6C6"},{"$f":"Logik!K1","v":"G1"},"G1",false,"","B7B6B5","",false,"","A6C6","","","G1",0,{"$f":"IF(P8<>\"\",OFFSET(Logik!$D$4,0,ROW()-1),0)","v":0},"B7B6B5"]
[null,null,null,"Försvar",{"$f":"SUM(R18:R33)+SUM(S18:S33)","v":0},{"$f":"Logik!L1","v":"H1"},"H1",false,"","B7B6B5","",false,"","A6C6","","","H1",0,{"$f":"IF(P9<>\"\",OFFSET(Logik!$D$4,0,ROW()-1),0)","v":0},"B7B6B5"]
[null,null,null,"Attack",{"$f":"SUM(R2:R17)+SUM(S2:S17)","v":0},{"$f":"Logik!M1","v":"A2"},"A2",false,"","B7B6B5","",false,"","A6C6","","","A2",0,{"$f":"IF(P10<>\"\",OFFSET(Logik!$D$4,0,ROW()-1),0)","v":0},"B7B6B5"]
[null,null,null,"R Antal",{"$f":"LEN(E8)/2","v":5},{"$f":"Logik!N1","v":"B2"},"B2",false,"","B7B6B5","",false,"","A6C6","","","B2",0,{"$f":"IF(P11<>\"\",OFFSET(Logik!$D$4,0,ROW()-1),0)","v":0},"B7B6B5"]
[null,null,null,null,null,{"$f":"Logik!O1","v":"C2"},"C2",false,"","B7B6B5","",false,"","A6C6","","","C2",0,{"$f":"IF(P12<>\"\",OFFSET(Logik!$D$4,0,ROW()-1),0)","v":0},"B7B6B5"]
[null,null,null,"MöjligaDrag",{"$f":"T33","v":"B6B5"},{"$f":"Logik!P1","v":"D2"},"D2",false,"","B7B6B5","",false,"","A6C6","","","D2",0,{"$f":"IF(P13<>\"\",OFFSET(Logik!$D$4,0,ROW()-1),0)","v":0},"B7B6B5"]
[null,null,null,"D Antal",{"$f":"LEN(E13)/2","v":2},{"$f":"Logik!Q1","v":"E2"},"E2",false,"","B7B6B5","",false,"","A6C6","","","E2",0,{"$f":"IF(P14<>\"\",OFFSET(Logik!$D$4,0,ROW()-1),0)","v":0},"B7B6B5"]
[null,null,null,null,null,{"$f":"Logik!R1","v":"F2"},"F2",false,"","B7B6B5","",false,"","A6C6","","","F2",0,{"$f":"IF(P15<>\"\",OFFSET(Logik!$D$4,0,ROW()-1),0)","v":0},"B7B6B5"]
[null,null,null,null,null,{"$f":"Logik!S1","v":"G2"},"G2",false,"","B7B6B5","",false,"","A6C6","","","G2",0,{"$f":"IF(P16<>\"\",OFFSET(Logik!$D$4,0,ROW()-1),0)","v":0},"B7B6B5"]
[null,null,null,null,null,{"$f":"Logik!T1","v":"H2"},"H2",false,"","B7B6B5","",false,"","A6C6","","","H2",0,{"$f":"IF(P17<>\"\",OFFSET(Logik!$D$4,0,ROW()-1),0)","v":0},"B7B6B5"]
[null,null,null,null,null,{"$f":"Logik!U1","v":"A7"},"A7",false,"","B7B6B5","",false,"","A6C6","","","A7",{"$f":"IF(P18<>\"\",HLOOKUP(HLOOKUP(Q18,PjasStart,2,FALSE),Pjaser,4,FALSE),0)","v":0},{"$f":"IF(P18<>\"\",OFFSET(Logik!$D$4,0,ROW()-1),0)","v":0},{"$f":"SUBSTITUTE(T17,G18,\"\")","v":"B7B6B5"}]
[null,null,null,null,null,{"$f":"Logik!V1","v":"B7"},"B7",false,"","B7B6B5","",false,"","A6C6","","","B7",0,{"$f":"IF(P19<>\"\",OFFSET(Logik!$D$4,0,ROW()-1),0)","v":0},{"$f":"SUBSTITUTE(T18,G19,\"\")","v":"B6B5"}]
[null,null,null,null,null,{"$f":"Logik!W1","v":"C7"},"C7",false,"","B7B6B5","",false,"","A6C6","","","C7",0,{"$f":"IF(P20<>\"\",OFFSET(Logik!$D$4,0,ROW()-1),0)","v":0},{"$f":"SUBSTITUTE(T19,G20,\"\")","v":"B6B5"}]
[null,null,null,null,null,{"$f":"Logik!X1","v":"D7"},"D7",false,"","B7B6B5","",false,"","A6C6","","","D7",0,{"$f":"IF(P21<>\"\",OFFSET(Logik!$D$4,0,ROW()-1),0)","v":0},"B6B5"]
[null,null,null,null,null,{"$f":"Logik!Y1","v":"E7"},"E7",false,"","B7B6B5","",false,"","A6C6","","","E7",0,{"$f":"IF(P22<>\"\",OFFSET(Logik!$D$4,0,ROW()-1),0)","v":0},"B6B5"]
[null,null,null,null,null,{"$f":"Logik!Z1","v":"F7"},"F7",false,"","B7B6B5","",false,"","A6C6","","","F7",0,{"$f":"IF(P23<>\"\",OFFSET(Logik!$D$4,0,ROW()-1),0)","v":0},"B6B5"]
[null,null,null,null,null,{"$f":"Logik!AA1","v":"G7"},"G7",false,"","B7B6B5","",false,"","A6C6","","","G7",0,{"$f":"IF(P24<>\"\",OFFSET(Logik!$D$4,0,ROW()-1),0)","v":0},"B6B5"]
[null,null,null,null,null,{"$f":"Logik!AB1","v":"H7"},"H7",false,"","B7B6B5","",false,"","A6C6","","","H7",0,{"$f":"IF(P25<>\"\",OFFSET(Logik!$D$4,0,ROW()-1),0)","v":0},"B6B5"]
[null,null,null,null,null,{"$f":"Logik!AC1","v":"A8"},"A8",false,"","B7B6B5","",false,"","A6C6","","","A8",0,{"$f":"IF(P26<>\"\",OFFSET(Logik!$D$4,0,ROW()-1),0)","v":0},"B6B5"]
[null,null,null,null,null,{"$f":"Logik!AD1","v":"B8"},"B8",false,"","B7B6B5","",false,"","A6C6","","","B8",0,{"$f":"IF(P27<>\"\",OFFSET(Logik!$D$4,0,ROW()-1),0)","v":0},"B6B5"]
[null,null,null,null,null,{"$f":"Logik!AE1","v":"C8"},"C8",false,"","B7B6B5","",false,"","A6C6","","","C8",0,{"$f":"IF(P28<>\"\",OFFSET(Logik!$D$4,0,ROW()-1),0)","v":0},"B6B5"]
[null,null,null,null,null,{"$f":"Logik!AF1","v":"D8"},"D8",false,"","B7B6B5","",false,"","A6C6","","","D8",0,{"$f":"IF(P29<>\"\",OFFSET(Logik!$D$4,0,ROW()-1),0)","v":0},"B6B5"]
[null,null,null,null,null,{"$f":"Logik!AG1","v":"E8"},"E8",false,"","B7B6B5","",false,"","A6C6","","","E8",0,{"$f":"IF(P30<>\"\",OFFSET(Logik!$D$4,0,ROW()-1),0)","v":0},"B6B5"]
[null,null,null,null,null,{"$f":"Logik!AH1","v":"F8"},"F8",false,"","B7B6B5","",false,"","A6C6","","","F8",0,{"$f":"IF(P31<>\"\",OFFSET(Logik!$D$4,0,ROW()-1),0)","v":0},"B6B5"]
[null,null,null,null,null,{"$f":"Logik!AI1","v":"G8"},"G8",false,"","B7B6B5","",false,"","A6C6","","","G8",0,{"$f":"IF(P32<>\"\",OFFSET(Logik!$D$4,0,ROW()-1),0)","v":0},"B6B5"]
[null,null,null,null,null,{"$f":"Logik!AJ1","v":"H8"},"H8",false,"","B7B6B5","",false,"","A6C6","","","H8",0,{"$f":"IF(P33<>\"\",OFFSET(Logik!$D$4,0,ROW()-1),0)","v":0},"B6B5"]

{"sheet":"P_C7","index":39,"n_rows":33,"n_cols":20,"rows_kept":33,"cut":false,"hidden":true,"merged":[]}
[null,null,null,null,null,{"$f":"Logik!D1","v":"Pos:"},"Pjäs:","Fräckvidd","Pos",{"$f":"RIGHT($E$2,LEN($E$2)-$E$4+1)","v":"C7C6C5"},{"$f":"LEFT($E$2,$E$4-1)","v":""},"Aräckvidd",null,{"$f":"RIGHT($E$3,LEN($E$3)-$E$5+1)","v":"B6D6"},{"$f":"IF(E5=0,\"\",(LEFT($E$3,$E$5-1)))","v":""},"Nåbar","Vad","Poäng","PosPoäng","MöjligaDrag"]
["Pjäs:",{"$f":"Logik!W2","v":"C7"},null,"FRäckvidd",{"$f":"IFERROR(INDEX(tblRVB,MATCH(\"SB\"&$B$3,RVB!$A$2:$A$120,0),5),\"\")","v":"C7C6C5"},{"$f":"UPPER(Logik!E1)","v":"A1"},{"$f":"UPPER(F2)","v":"A1"},{"$f":"IF($G2<>\"\",IF($G2<>$B$3,IF(IFERROR(FIND($G2,$E$2)>0,FALSE),TRUE,FALSE),FALSE),FALSE)","v":false},{"$f":"IF(H2,FIND($G2,$E$2),\"\")","v":""},{"$f":"IF(AND(I2<>\"\",I2>0,I2>$E$4),LEFT(J1,MIN(I2-$E$4+2,LEN(J1))),J1)","v":"C7C6C5"},{"$f":"IF(AND($G2<>\"\",$G2>0,$I2<$E$4),RIGHT(K1,MIN($E$4-$I2,LEN(K1))),K1)","v":""},{"$f":"IF($G2<>\"\",IF($G2<>$B$3,IF(IFERROR(FIND($G2,$E$3)>0,FALSE),TRUE,FALSE),FALSE),FALSE)","v":false},{"$f":"IF(L2,FIND($G2,$E$3),\"\")","v":""},{"$f":"IF(AND(M2<>\"\",M2>0,M2>$E$5),LEFT(N1,MIN(M2-$E$5+3,LEN(N1))),N1)","v":"B6D6"},{"$f":"IF(AND($G2<>\"\",$G2>0,M2<$E$5),RIGHT(O1,MIN($E$5-M2,LEN(O1))),O1)","v":""},{"$f":"IFERROR(IF(AND(G2<>\"\",$G2<>$B$3),FIND(G2,$E$7),\"\"),\"\")","v":""},"A1",{"$f":"IF(P2<>\"\",HLOOKUP(HLOOKUP(Q2,PjasStart,2,FALSE),Pjaser,3,FALSE),0)","v":0},{"$f":"IF(P2<>\"\",OFFSET(Logik!$D$4,0,ROW()-1),0)","v":0},{"$f":"SUBSTITUTE(E6,G2,\"\")&IF(IFERROR(FIND(G2,N2)>0,FALSE),G2,\"\")","v":"C7C6C5"}]
["Pos:",{"$f":"UPPER(Logik!W1)","v":"C7"},null,"Aräckvidd",{"$f":"IFERROR(INDEX(tblRVB,MATCH(\"SB\"&$B$3,RVB!$A$2:$A$120,0),6),\"\")","v":"B6D6"},{"$f":"Logik!F1","v":"B1"},{"$f":"UPPER(F3)","v":"B1"},{"$f":"IF($G3<>\"\",IF($G3<>$B$3,IF(IFERROR(FIND($G3,$E$2)>0,FALSE),TRUE,FALSE),FALSE),FALSE)","v":false},{"$f":"IF(H3,FIND($G3,$E$2),\"\")","v":""},{"$f":"IF(AND(I3<>\"\",I3>0,I3>$E$4),LEFT(J2,MIN(I3-$E$4+2,LEN(J2))),J2)","v":"C7C6C5"},{"$f":"IF(AND($G3<>\"\",$G3>0,$I3<$E$4),RIGHT(K2,MIN($E$4-$I3,LEN(K2))),K2)","v":""},{"$f":"IF($G3<>\"\",IF($G3<>$B$3,IF(IFERROR(FIND($G3,$E$3)>0,FALSE),TRUE,FALSE),FALSE),FALSE)","v":false},{"$f":"IF(L3,FIND($G3,$E$3),\"\")","v":""},{"$f":"IF(AND(M3<>\"\",M3>0,M3>$E$5),LEFT(N2,MIN(M3-$E$5+3,LEN(N2))),N2)","v":"B6D6"},{"$f":"IF(AND($G3<>\"\",$G3>0,M3<$E$5),RIGHT(O2,MIN($E$5-M3,LEN(O2))),O2)","v":""},{"$f":"IFERROR(IF(AND(G3<>\"\",$G3<>$B$3),FIND(G3,$E$7),\"\"),\"\")","v":""},"B1",0,{"$f":"IF(P3<>\"\",OFFSET(Logik!$D$4,0,ROW()-1),0)","v":0},{"$f":"SUBSTITUTE(T2,G3,\"\")&IF(IFERROR(FIND(G3,N3)>0,FALSE),G3,\"\")","v":"C7C6C5"}]
["PosX:",{"$f":"LEFT(B3,1)","v":"C"},null,"PosX",{"$f":"FIND(B3,E2)","v":1},{"$f":"Logik!G1","v":"C1"},"C1",false,"","C7C6C5","",false,"","B6D6","","","C1",0,{"$f":"IF(P4<>\"\",OFFSET(Logik!$D$4,0,ROW()-1),0)","v":0},{"$f":"SUBSTITUTE(T3,G4,\"\")&IF(IFERROR(FIND(G4,N4)>0,FALSE),G4,\"\")","v":"C7C6C5"}]
["PosY:",{"$f":"RIGHT(B3,1)","v":"7"},null,"PosY",{"$f":"IFERROR(FIND(B3,E3),0)","v":0},{"$f":"Logik!H1","v":"D1"},"D1",false,"","C7C6C5","",false,"","B6D6","","","D1",0,{"$f":"IF(P5<>\"\",OFFSET(Logik!$D$4,0,ROW()-1),0)","v":0},"C7C6C5"]
[null,null,null,"RX",{"$f":"K33&J33","v":"C7C6C5"},{"$f":"Logik!I1","v":"E1"},"E1",false,"","C7C6C5","",false,"","B6D6","","","E1",0,{"$f":"IF(P6<>\"\",OFFSET(Logik!$D$4,0,ROW()-1),0)","v":0},"C7C6C5"]
["Poäng",{"$f":"Logik!W3","v":100},null,"RA",{"$f":"O33&N33","v":"B6D6"},{"$f":"Logik!J1","v":"F1"},"F1",false,"","C7C6C5","",false,"","B6D6","","","F1",0,{"$f":"IF(P7<>\"\",OFFSET(Logik!$D$4,0,ROW()-1),0)","v":0},"C7C6C5"]
["PosPoäng",{"$f":"Logik!W4","v":0},null,"RXY",{"$f":"E6&E7","v":"C7C6C5B6D6"},{"$f":"Logik!K1","v":"G1"},"G1",false,"","C7C6C5","",false,"","B6D6","","","G1",0,{"$f":"IF(P8<>\"\",OFFSET(Logik!$D$4,0,ROW()-1),0)","v":0},"C7C6C5"]
[null,null,null,"Försvar",{"$f":"SUM(R18:R33)+SUM(S18:S33)","v":0},{"$f":"Logik!L1","v":"H1"},"H1",false,"","C7C6C5","",false,"","B6D6","","","H1",0,{"$f":"IF(P9<>\"\",OFFSET(Logik!$D$4,0,ROW()-1),0)","v":0},"C7C6C5"]
[null,null,null,"Attack",{"$f":"SUM(R2:R17)+SUM(S2:S17)","v":0},{"$f":"Logik!M1","v":"A2"},"A2",false,"","C7C6C5","",false,"","B6D6","","","A2",0,{"$f":"IF(P10<>\"\",OFFSET(Logik!$D$4,0,ROW()-1),0)","v":0},"C7C6C5"]
[null,null,null,"R Antal",{"$f":"LEN(E8)/2","v":5},{"$f":"Logik!N1","v":"B2"},"B2",false,"","C7C6C5","",false,"","B6D6","","","B2",0,{"$f":"IF(P11<>\"\",OFFSET(Logik!$D$4,0,ROW()-1),0)","v":0},"C7C6C5"]
[null,null,null,null,null,{"$f":"Logik!O1","v":"C2"},"C2",false,"","C7C6C5","",false,"","B6D6","","","C2",0,{"$f":"IF(P12<>\"\",OFFSET(Logik!$D$4,0,ROW()-1),0)","v":0},"C7C6C5"]
[null,null,null,"MöjligaDrag",{"$f":"T33","v":"C6C5"},{"$f":"Logik!P1","v":"D2"},"D2",false,"","C7C6C5","",false,"","B6D6","","","D2",0,{"$f":"IF(P13<>\"\",OFFSET(Logik!$D$4,0,ROW()-1),0)","v":0},"C7C6C5"]
[null,null,null,"D Antal",{"$f":"LEN(E13)/2","v":2},{"$f":"Logik!Q1","v":"E2"},"E2",false,"","C7C6C5","",false,"","B6D6","","","E2",0,{"$f":"IF(P14<>\"\",OFFSET(Logik!$D$4,0,ROW()-1),0)","v":0},"C7C6C5"]
[null,null,null,null,null,{"$f":"Logik!R1","v":"F2"},"F2",false,"","C7C6C5","",false,"","B6D6","","","F2",0,{"$f":"IF(P15<>\"\",OFFSET(Logik!$D$4,0,ROW()-1),0)","v":0},"C7C6C5"]
[null,null,null,null,null,{"$f":"Logik!S1","v":"G2"},"G2",false,"","C7C6C5","",false,"","B6D6","","","G2",0,{"$f":"IF(P16<>\"\",OFFSET(Logik!$D$4,0,ROW()-1),0)","v":0},"C7C6C5"]
[null,null,null,null,null,{"$f":"Logik!T1","v":"H2"},"H2",false,"","C7C6C5","",false,"","B6D6","","","H2",0,{"$f":"IF(P17<>\"\",OFFSET(Logik!$D$4,0,ROW()-1),0)","v":0},"C7C6C5"]
[null,null,null,null,null,{"$f":"Logik!U1","v":"A7"},"A7",false,"","C7C6C5","",false,"","B6D6","","","A7",{"$f":"IF(P18<>\"\",HLOOKUP(HLOOKUP(Q18,PjasStart,2,FALSE),Pjaser,4,FALSE),0)","v":0},{"$f":"IF(P18<>\"\",OFFSET(Logik!$D$4,0,ROW()-1),0)","v":0},{"$f":"SUBSTITUTE(T17,G18,\"\")","v":"C7C6C5"}]
[null,null,null,null,null,{"$f":"Logik!V1","v":"B7"},"B7",false,"","C7C6C5","",false,"","B6D6","","","B7",0,{"$f":"IF(P19<>\"\",OFFSET(Logik!$D$4,0,ROW()-1),0)","v":0},{"$f":"SUBSTITUTE(T18,G19,\"\")","v":"C7C6C5"}]
[null,null,null,null,null,{"$f":"Logik!W1","v":"C7"},"C7",false,"","C7C6C5","",false,"","B6D6","","","C7",0,{"$f":"IF(P20<>\"\",OFFSET(Logik!$D$4,0,ROW()-1),0)","v":0},{"$f":"SUBSTITUTE(T19,G20,\"\")","v":"C6C5"}]
[null,null,null,null,null,{"$f":"Logik!X1","v":"D7"},"D7",false,"","C7C6C5","",false,"","B6D6","","","D7",0,{"$f":"IF(P21<>\"\",OFFSET(Logik!$D$4,0,ROW()-1),0)","v":0},"C6C5"]
[null,null,null,null,null,{"$f":"Logik!Y1","v":"E7"},"E7",false,"","C7C6C5","",false,"","B6D6","","","E7",0,{"$f":"IF(P22<>\"\",OFFSET(Logik!$D$4,0,ROW()-1),0)","v":0},"C6C5"]
[null,null,null,null,null,{"$f":"Logik!Z1","v":"F7"},"F7",false,"","C7C6C5","",false,"","B6D6","","","F7",0,{"$f":"IF(P23<>\"\",OFFSET(Logik!$D$4,0,ROW()-1),0)","v":0},"C6C5"]
[null,null,null,null,null,{"$f":"Logik!AA1","v":"G7"},"G7",false,"","C7C6C5","",false,"","B6D6","","","G7",0,{"$f":"IF(P24<>\"\",OFFSET(Logik!$D$4,0,ROW()-1),0)","v":0},"C6C5"]
[null,null,null,null,null,{"$f":"Logik!AB1","v":"H7"},"H7",false,"","C7C6C5","",false,"","B6D6","","","H7",0,{"$f":"IF(P25<>\"\",OFFSET(Logik!$D$4,0,ROW()-1),0)","v":0},"C6C5"]
[null,null,null,null,null,{"$f":"Logik!AC1","v":"A8"},"A8",false,"","C7C6C5","",false,"","B6D6","","","A8",0,{"$f":"IF(P26<>\"\",OFFSET(Logik!$D$4,0,ROW()-1),0)","v":0},"C6C5"]
[null,null,null,null,null,{"$f":"Logik!AD1","v":"B8"},"B8",false,"","C7C6C5","",false,"","B6D6","","","B8",0,{"$f":"IF(P27<>\"\",OFFSET(Logik!$D$4,0,ROW()-1),0)","v":0},"C6C5"]
[null,null,null,null,null,{"$f":"Logik!AE1","v":"C8"},"C8",false,"","C7C6C5","",false,"","B6D6","","","C8",0,{"$f":"IF(P28<>\"\",OFFSET(Logik!$D$4,0,ROW()-1),0)","v":0},"C6C5"]
[null,null,null,null,null,{"$f":"Logik!AF1","v":"D8"},"D8",false,"","C7C6C5","",false,"","B6D6","","","D8",0,{"$f":"IF(P29<>\"\",OFFSET(Logik!$D$4,0,ROW()-1),0)","v":0},"C6C5"]
[null,null,null,null,null,{"$f":"Logik!AG1","v":"E8"},"E8",false,"","C7C6C5","",false,"","B6D6","","","E8",0,{"$f":"IF(P30<>\"\",OFFSET(Logik!$D$4,0,ROW()-1),0)","v":0},"C6C5"]
[null,null,null,null,null,{"$f":"Logik!AH1","v":"F8"},"F8",false,"","C7C6C5","",false,"","B6D6","","","F8",0,{"$f":"IF(P31<>\"\",OFFSET(Logik!$D$4,0,ROW()-1),0)","v":0},"C6C5"]
[null,null,null,null,null,{"$f":"Logik!AI1","v":"G8"},"G8",false,"","C7C6C5","",false,"","B6D6","","","G8",0,{"$f":"IF(P32<>\"\",OFFSET(Logik!$D$4,0,ROW()-1),0)","v":0},"C6C5"]
[null,null,null,null,null,{"$f":"Logik!AJ1","v":"H8"},"H8",false,"","C7C6C5","",false,"","B6D6","","","H8",0,{"$f":"IF(P33<>\"\",OFFSET(Logik!$D$4,0,ROW()-1),0)","v":0},"C6C5"]

{"sheet":"P_D7","index":40,"n_rows":33,"n_cols":20,"rows_kept":33,"cut":false,"hidden":true,"merged":[]}
[null,null,null,null,null,{"$f":"Logik!D1","v":"Pos:"},"Pjäs:","Fräckvidd","Pos",{"$f":"RIGHT($E$2,LEN($E$2)-$E$4+1)","v":"D7D6D5"},{"$f":"LEFT($E$2,$E$4-1)","v":""},"Aräckvidd",null,{"$f":"RIGHT($E$3,LEN($E$3)-$E$5+1)","v":"C6E6"},{"$f":"IF(E5=0,\"\",(LEFT($E$3,$E$5-1)))","v":""},"Nåbar","Vad","Poäng","PosPoäng","MöjligaDrag"]
["Pjäs:",{"$f":"Logik!X2","v":"D7"},null,"FRäckvidd",{"$f":"IFERROR(INDEX(tblRVB,MATCH(\"SB\"&$B$3,RVB!$A$2:$A$120,0),5),\"\")","v":"D7D6D5"},{"$f":"UPPER(Logik!E1)","v":"A1"},{"$f":"UPPER(F2)","v":"A1"},{"$f":"IF($G2<>\"\",IF($G2<>$B$3,IF(IFERROR(FIND($G2,$E$2)>0,FALSE),TRUE,FALSE),FALSE),FALSE)","v":false},{"$f":"IF(H2,FIND($G2,$E$2),\"\")","v":""},{"$f":"IF(AND(I2<>\"\",I2>0,I2>$E$4),LEFT(J1,MIN(I2-$E$4+2,LEN(J1))),J1)","v":"D7D6D5"},{"$f":"IF(AND($G2<>\"\",$G2>0,$I2<$E$4),RIGHT(K1,MIN($E$4-$I2,LEN(K1))),K1)","v":""},{"$f":"IF($G2<>\"\",IF($G2<>$B$3,IF(IFERROR(FIND($G2,$E$3)>0,FALSE),TRUE,FALSE),FALSE),FALSE)","v":false},{"$f":"IF(L2,FIND($G2,$E$3),\"\")","v":""},{"$f":"IF(AND(M2<>\"\",M2>0,M2>$E$5),LEFT(N1,MIN(M2-$E$5+3,LEN(N1))),N1)","v":"C6E6"},{"$f":"IF(AND($G2<>\"\",$G2>0,M2<$E$5),RIGHT(O1,MIN($E$5-M2,LEN(O1))),O1)","v":""},{"$f":"IFERROR(IF(AND(G2<>\"\",$G2<>$B$3),FIND(G2,$E$7),\"\"),\"\")","v":""},"A1",{"$f":"IF(P2<>\"\",HLOOKUP(HLOOKUP(Q2,PjasStart,2,FALSE),Pjaser,3,FALSE),0)","v":0},{"$f":"IF(P2<>\"\",OFFSET(Logik!$D$4,0,ROW()-1),0)","v":0},{"$f":"SUBSTITUTE(E6,G2,\"\")&IF(IFERROR(FIND(G2,N2)>0,FALSE),G2,\"\")","v":"D7D6D5"}]
["Pos:",{"$f":"UPPER(Logik!X1)","v":"D7"},null,"Aräckvidd",{"$f":"IFERROR(INDEX(tblRVB,MATCH(\"SB\"&$B$3,RVB!$A$2:$A$120,0),6),\"\")","v":"C6E6"},{"$f":"Logik!F1","v":"B1"},{"$f":"UPPER(F3)","v":"B1"},{"$f":"IF($G3<>\"\",IF($G3<>$B$3,IF(IFERROR(FIND($G3,$E$2)>0,FALSE),TRUE,FALSE),FALSE),FALSE)","v":false},{"$f":"IF(H3,FIND($G3,$E$2),\"\")","v":""},{"$f":"IF(AND(I3<>\"\",I3>0,I3>$E$4),LEFT(J2,MIN(I3-$E$4+2,LEN(J2))),J2)","v":"D7D6D5"},{"$f":"IF(AND($G3<>\"\",$G3>0,$I3<$E$4),RIGHT(K2,MIN($E$4-$I3,LEN(K2))),K2)","v":""},{"$f":"IF($G3<>\"\",IF($G3<>$B$3,IF(IFERROR(FIND($G3,$E$3)>0,FALSE),TRUE,FALSE),FALSE),FALSE)","v":false},{"$f":"IF(L3,FIND($G3,$E$3),\"\")","v":""},{"$f":"IF(AND(M3<>\"\",M3>0,M3>$E$5),LEFT(N2,MIN(M3-$E$5+3,LEN(N2))),N2)","v":"C6E6"},{"$f":"IF(AND($G3<>\"\",$G3>0,M3<$E$5),RIGHT(O2,MIN($E$5-M3,LEN(O2))),O2)","v":""},{"$f":"IFERROR(IF(AND(G3<>\"\",$G3<>$B$3),FIND(G3,$E$7),\"\"),\"\")","v":""},"B1",0,{"$f":"IF(P3<>\"\",OFFSET(Logik!$D$4,0,ROW()-1),0)","v":0},{"$f":"SUBSTITUTE(T2,G3,\"\")&IF(IFERROR(FIND(G3,N3)>0,FALSE),G3,\"\")","v":"D7D6D5"}]
["PosX:",{"$f":"LEFT(B3,1)","v":"D"},null,"PosX",{"$f":"FIND(B3,E2)","v":1},{"$f":"Logik!G1","v":"C1"},"C1",false,"","D7D6D5","",false,"","C6E6","","","C1",0,{"$f":"IF(P4<>\"\",OFFSET(Logik!$D$4,0,ROW()-1),0)","v":0},{"$f":"SUBSTITUTE(T3,G4,\"\")&IF(IFERROR(FIND(G4,N4)>0,FALSE),G4,\"\")","v":"D7D6D5"}]
["PosY:",{"$f":"RIGHT(B3,1)","v":"7"},null,"PosY",{"$f":"IFERROR(FIND(B3,E3),0)","v":0},{"$f":"Logik!H1","v":"D1"},"D1",false,"","D7D6D5","",false,"","C6E6","","","D1",0,{"$f":"IF(P5<>\"\",OFFSET(Logik!$D$4,0,ROW()-1),0)","v":0},"D7D6D5"]
[null,null,null,"RX",{"$f":"K33&J33","v":"D7D6D5"},{"$f":"Logik!I1","v":"E1"},"E1",false,"","D7D6D5","",false,"","C6E6","","","E1",0,{"$f":"IF(P6<>\"\",OFFSET(Logik!$D$4,0,ROW()-1),0)","v":0},"D7D6D5"]
["Poäng",{"$f":"Logik!X3","v":100},null,"RA",{"$f":"O33&N33","v":"C6E6"},{"$f":"Logik!J1","v":"F1"},"F1",false,"","D7D6D5","",false,"","C6E6","","","F1",0,{"$f":"IF(P7<>\"\",OFFSET(Logik!$D$4,0,ROW()-1),0)","v":0},"D7D6D5"]
["PosPoäng",{"$f":"Logik!X4","v":0},null,"RXY",{"$f":"E6&E7","v":"D7D6D5C6E6"},{"$f":"Logik!K1","v":"G1"},"G1",false,"","D7D6D5","",false,"","C6E6","","","G1",0,{"$f":"IF(P8<>\"\",OFFSET(Logik!$D$4,0,ROW()-1),0)","v":0},"D7D6D5"]
[null,null,null,"Försvar",{"$f":"SUM(R18:R33)+SUM(S18:S33)","v":0},{"$f":"Logik!L1","v":"H1"},"H1",false,"","D7D6D5","",false,"","C6E6","","","H1",0,{"$f":"IF(P9<>\"\",OFFSET(Logik!$D$4,0,ROW()-1),0)","v":0},"D7D6D5"]
[null,null,null,"Attack",{"$f":"SUM(R2:R17)+SUM(S2:S17)","v":0},{"$f":"Logik!M1","v":"A2"},"A2",false,"","D7D6D5","",false,"","C6E6","","","A2",0,{"$f":"IF(P10<>\"\",OFFSET(Logik!$D$4,0,ROW()-1),0)","v":0},"D7D6D5"]
[null,null,null,"R Antal",{"$f":"LEN(E8)/2","v":5},{"$f":"Logik!N1","v":"B2"},"B2",false,"","D7D6D5","",false,"","C6E6","","","B2",0,{"$f":"IF(P11<>\"\",OFFSET(Logik!$D$4,0,ROW()-1),0)","v":0},"D7D6D5"]
[null,null,null,null,null,{"$f":"Logik!O1","v":"C2"},"C2",false,"","D7D6D5","",false,"","C6E6","","","C2",0,{"$f":"IF(P12<>\"\",OFFSET(Logik!$D$4,0,ROW()-1),0)","v":0},"D7D6D5"]
[null,null,null,"MöjligaDrag",{"$f":"T33","v":"D6D5"},{"$f":"Logik!P1","v":"D2"},"D2",false,"","D7D6D5","",false,"","C6E6","","","D2",0,{"$f":"IF(P13<>\"\",OFFSET(Logik!$D$4,0,ROW()-1),0)","v":0},"D7D6D5"]
[null,null,null,"D Antal",{"$f":"LEN(E13)/2","v":2},{"$f":"Logik!Q1","v":"E2"},"E2",false,"","D7D6D5","",false,"","C6E6","","","E2",0,{"$f":"IF(P14<>\"\",OFFSET(Logik!$D$4,0,ROW()-1),0)","v":0},"D7D6D5"]
[null,null,null,null,null,{"$f":"Logik!R1","v":"F2"},"F2",false,"","D7D6D5","",false,"","C6E6","","","F2",0,{"$f":"IF(P15<>\"\",OFFSET(Logik!$D$4,0,ROW()-1),0)","v":0},"D7D6D5"]
[null,null,null,null,null,{"$f":"Logik!S1","v":"G2"},"G2",false,"","D7D6D5","",false,"","C6E6","","","G2",0,{"$f":"IF(P16<>\"\",OFFSET(Logik!$D$4,0,ROW()-1),0)","v":0},"D7D6D5"]
[null,null,null,null,null,{"$f":"Logik!T1","v":"H2"},"H2",false,"","D7D6D5","",false,"","C6E6","","","H2",0,{"$f":"IF(P17<>\"\",OFFSET(Logik!$D$4,0,ROW()-1),0)","v":0},"D7D6D5"]
[null,null,null,null,null,{"$f":"Logik!U1","v":"A7"},"A7",false,"","D7D6D5","",false,"","C6E6","","","A7",{"$f":"IF(P18<>\"\",HLOOKUP(HLOOKUP(Q18,PjasStart,2,FALSE),Pjaser,4,FALSE),0)","v":0},{"$f":"IF(P18<>\"\",OFFSET(Logik!$D$4,0,ROW()-1),0)","v":0},{"$f":"SUBSTITUTE(T17,G18,\"\")","v":"D7D6D5"}]
[null,null,null,null,null,{"$f":"Logik!V1","v":"B7"},"B7",false,"","D7D6D5","",false,"","C6E6","","","B7",0,{"$f":"IF(P19<>\"\",OFFSET(Logik!$D$4,0,ROW()-1),0)","v":0},{"$f":"SUBSTITUTE(T18,G19,\"\")","v":"D7D6D5"}]
[null,null,null,null,null,{"$f":"Logik!W1","v":"C7"},"C7",false,"","D7D6D5","",false,"","C6E6","","","C7",0,{"$f":"IF(P20<>\"\",OFFSET(Logik!$D$4,0,ROW()-1),0)","v":0},{"$f":"SUBSTITUTE(T19,G20,\"\")","v":"D7D6D5"}]
[null,null,null,null,null,{"$f":"Logik!X1","v":"D7"},"D7",false,"","D7D6D5","",false,"","C6E6","","","D7",0,{"$f":"IF(P21<>\"\",OFFSET(Logik!$D$4,0,ROW()-1),0)","v":0},"D6D5"]
[null,null,null,null,null,{"$f":"Logik!Y1","v":"E7"},"E7",false,"","D7D6D5","",false,"","C6E6","","","E7",0,{"$f":"IF(P22<>\"\",OFFSET(Logik!$D$4,0,ROW()-1),0)","v":0},"D6D5"]
[null,null,null,null,null,{"$f":"Logik!Z1","v":"F7"},"F7",false,"","D7D6D5","",false,"","C6E6","","","F7",0,{"$f":"IF(P23<>\"\",OFFSET(Logik!$D$4,0,ROW()-1),0)","v":0},"D6D5"]
[null,null,null,null,null,{"$f":"Logik!AA1","v":"G7"},"G7",false,"","D7D6D5","",false,"","C6E6","","","G7",0,{"$f":"IF(P24<>\"\",OFFSET(Logik!$D$4,0,ROW()-1),0)","v":0},"D6D5"]
[null,null,null,null,null,{"$f":"Logik!AB1","v":"H7"},"H7",false,"","D7D6D5","",false,"","C6E6","","","H7",0,{"$f":"IF(P25<>\"\",OFFSET(Logik!$D$4,0,ROW()-1),0)","v":0},"D6D5"]
[null,null,null,null,null,{"$f":"Logik!AC1","v":"A8"},"A8",false,"","D7D6D5","",false,"","C6E6","","","A8",0,{"$f":"IF(P26<>\"\",OFFSET(Logik!$D$4,0,ROW()-1),0)","v":0},"D6D5"]
[null,null,null,null,null,{"$f":"Logik!AD1","v":"B8"},"B8",false,"","D7D6D5","",false,"","C6E6","","","B8",0,{"$f":"IF(P27<>\"\",OFFSET(Logik!$D$4,0,ROW()-1),0)","v":0},"D6D5"]
[null,null,null,null,null,{"$f":"Logik!AE1","v":"C8"},"C8",false,"","D7D6D5","",false,"","C6E6","","","C8",0,{"$f":"IF(P28<>\"\",OFFSET(Logik!$D$4,0,ROW()-1),0)","v":0},"D6D5"]
[null,null,null,null,null,{"$f":"Logik!AF1","v":"D8"},"D8",false,"","D7D6D5","",false,"","C6E6","","","D8",0,{"$f":"IF(P29<>\"\",OFFSET(Logik!$D$4,0,ROW()-1),0)","v":0},"D6D5"]
[null,null,null,null,null,{"$f":"Logik!AG1","v":"E8"},"E8",false,"","D7D6D5","",false,"","C6E6","","","E8",0,{"$f":"IF(P30<>\"\",OFFSET(Logik!$D$4,0,ROW()-1),0)","v":0},"D6D5"]
[null,null,null,null,null,{"$f":"Logik!AH1","v":"F8"},"F8",false,"","D7D6D5","",false,"","C6E6","","","F8",0,{"$f":"IF(P31<>\"\",OFFSET(Logik!$D$4,0,ROW()-1),0)","v":0},"D6D5"]
[null,null,null,null,null,{"$f":"Logik!AI1","v":"G8"},"G8",false,"","D7D6D5","",false,"","C6E6","","","G8",0,{"$f":"IF(P32<>\"\",OFFSET(Logik!$D$4,0,ROW()-1),0)","v":0},"D6D5"]
[null,null,null,null,null,{"$f":"Logik!AJ1","v":"H8"},"H8",false,"","D7D6D5","",false,"","C6E6","","","H8",0,{"$f":"IF(P33<>\"\",OFFSET(Logik!$D$4,0,ROW()-1),0)","v":0},"D6D5"]

{"sheet":"P_E7","index":41,"n_rows":33,"n_cols":20,"rows_kept":33,"cut":false,"hidden":true,"merged":[]}
[null,null,null,null,null,{"$f":"Logik!D1","v":"Pos:"},"Pjäs:","Fräckvidd","Pos",{"$f":"RIGHT($E$2,LEN($E$2)-$E$4+1)","v":"E7E6E5"},{"$f":"LEFT($E$2,$E$4-1)","v":""},"Aräckvidd",null,{"$f":"RIGHT($E$3,LEN($E$3)-$E$5+1)","v":"D6F6"},{"$f":"IF(E5=0,\"\",(LEFT($E$3,$E$5-1)))","v":""},"Nåbar","Vad","Poäng","PosPoäng","MöjligaDrag"]
["Pjäs:",{"$f":"Logik!Y2","v":"E7"},null,"FRäckvidd",{"$f":"IFERROR(INDEX(tblRVB,MATCH(\"SB\"&$B$3,RVB!$A$2:$A$120,0),5),\"\")","v":"E7E6E5"},{"$f":"UPPER(Logik!E1)","v":"A1"},{"$f":"UPPER(F2)","v":"A1"},{"$f":"IF($G2<>\"\",IF($G2<>$B$3,IF(IFERROR(FIND($G2,$E$2)>0,FALSE),TRUE,FALSE),FALSE),FALSE)","v":false},{"$f":"IF(H2,FIND($G2,$E$2),\"\")","v":""},{"$f":"IF(AND(I2<>\"\",I2>0,I2>$E$4),LEFT(J1,MIN(I2-$E$4+2,LEN(J1))),J1)","v":"E7E6E5"},{"$f":"IF(AND($G2<>\"\",$G2>0,$I2<$E$4),RIGHT(K1,MIN($E$4-$I2,LEN(K1))),K1)","v":""},{"$f":"IF($G2<>\"\",IF($G2<>$B$3,IF(IFERROR(FIND($G2,$E$3)>0,FALSE),TRUE,FALSE),FALSE),FALSE)","v":false},{"$f":"IF(L2,FIND($G2,$E$3),\"\")","v":""},{"$f":"IF(AND(M2<>\"\",M2>0,M2>$E$5),LEFT(N1,MIN(M2-$E$5+3,LEN(N1))),N1)","v":"D6F6"},{"$f":"IF(AND($G2<>\"\",$G2>0,M2<$E$5),RIGHT(O1,MIN($E$5-M2,LEN(O1))),O1)","v":""},{"$f":"IFERROR(IF(AND(G2<>\"\",$G2<>$B$3),FIND(G2,$E$7),\"\"),\"\")","v":""},"A1",{"$f":"IF(P2<>\"\",HLOOKUP(HLOOKUP(Q2,PjasStart,2,FALSE),Pjaser,3,FALSE),0)","v":0},{"$f":"IF(P2<>\"\",OFFSET(Logik!$D$4,0,ROW()-1),0)","v":0},{"$f":"SUBSTITUTE(E6,G2,\"\")&IF(IFERROR(FIND(G2,N2)>0,FALSE),G2,\"\")","v":"E7E6E5"}]
["Pos:",{"$f":"UPPER(Logik!Y1)","v":"E7"},null,"Aräckvidd",{"$f":"IFERROR(INDEX(tblRVB,MATCH(\"SB\"&$B$3,RVB!$A$2:$A$120,0),6),\"\")","v":"D6F6"},{"$f":"Logik!F1","v":"B1"},{"$f":"UPPER(F3)","v":"B1"},{"$f":"IF($G3<>\"\",IF($G3<>$B$3,IF(IFERROR(FIND($G3,$E$2)>0,FALSE),TRUE,FALSE),FALSE),FALSE)","v":false},{"$f":"IF(H3,FIND($G3,$E$2),\"\")","v":""},{"$f":"IF(AND(I3<>\"\",I3>0,I3>$E$4),LEFT(J2,MIN(I3-$E$4+2,LEN(J2))),J2)","v":"E7E6E5"},{"$f":"IF(AND($G3<>\"\",$G3>0,$I3<$E$4),RIGHT(K2,MIN($E$4-$I3,LEN(K2))),K2)","v":""},{"$f":"IF($G3<>\"\",IF($G3<>$B$3,IF(IFERROR(FIND($G3,$E$3)>0,FALSE),TRUE,FALSE),FALSE),FALSE)","v":false},{"$f":"IF(L3,FIND($G3,$E$3),\"\")","v":""},{"$f":"IF(AND(M3<>\"\",M3>0,M3>$E$5),LEFT(N2,MIN(M3-$E$5+3,LEN(N2))),N2)","v":"D6F6"},{"$f":"IF(AND($G3<>\"\",$G3>0,M3<$E$5),RIGHT(O2,MIN($E$5-M3,LEN(O2))),O2)","v":""},{"$f":"IFERROR(IF(AND(G3<>\"\",$G3<>$B$3),FIND(G3,$E$7),\"\"),\"\")","v":""},"B1",0,{"$f":"IF(P3<>\"\",OFFSET(Logik!$D$4,0,ROW()-1),0)","v":0},{"$f":"SUBSTITUTE(T2,G3,\"\")&IF(IFERROR(FIND(G3,N3)>0,FALSE),G3,\"\")","v":"E7E6E5"}]
["PosX:",{"$f":"LEFT(B3,1)","v":"E"},null,"PosX",{"$f":"FIND(B3,E2)","v":1},{"$f":"Logik!G1","v":"C1"},"C1",false,"","E7E6E5","",false,"","D6F6","","","C1",0,{"$f":"IF(P4<>\"\",OFFSET(Logik!$D$4,0,ROW()-1),0)","v":0},{"$f":"SUBSTITUTE(T3,G4,\"\")&IF(IFERROR(FIND(G4,N4)>0,FALSE),G4,\"\")","v":"E7E6E5"}]
["PosY:",{"$f":"RIGHT(B3,1)","v":"7"},null,"PosY",{"$f":"IFERROR(FIND(B3,E3),0)","v":0},{"$f":"Logik!H1","v":"D1"},"D1",false,"","E7E6E5","",false,"","D6F6","","","D1",0,{"$f":"IF(P5<>\"\",OFFSET(Logik!$D$4,0,ROW()-1),0)","v":0},"E7E6E5"]
[null,null,null,"RX",{"$f":"K33&J33","v":"E7E6E5"},{"$f":"Logik!I1","v":"E1"},"E1",false,"","E7E6E5","",false,"","D6F6","","","E1",0,{"$f":"IF(P6<>\"\",OFFSET(Logik!$D$4,0,ROW()-1),0)","v":0},"E7E6E5"]
["Poäng",{"$f":"Logik!Y3","v":100},null,"RA",{"$f":"O33&N33","v":"D6F6"},{"$f":"Logik!J1","v":"F1"},"F1",false,"","E7E6E5","",false,"","D6F6","","","F1",0,{"$f":"IF(P7<>\"\",OFFSET(Logik!$D$4,0,ROW()-1),0)","v":0},"E7E6E5"]
["PosPoäng",{"$f":"Logik!Y4","v":0},null,"RXY",{"$f":"E6&E7","v":"E7E6E5D6F6"},{"$f":"Logik!K1","v":"G1"},"G1",false,"","E7E6E5","",false,"","D6F6","","","G1",0,{"$f":"IF(P8<>\"\",OFFSET(Logik!$D$4,0,ROW()-1),0)","v":0},"E7E6E5"]
[null,null,null,"Försvar",{"$f":"SUM(R18:R33)+SUM(S18:S33)","v":0},{"$f":"Logik!L1","v":"H1"},"H1",false,"","E7E6E5","",false,"","D6F6","","","H1",0,{"$f":"IF(P9<>\"\",OFFSET(Logik!$D$4,0,ROW()-1),0)","v":0},"E7E6E5"]
[null,null,null,"Attack",{"$f":"SUM(R2:R17)+SUM(S2:S17)","v":0},{"$f":"Logik!M1","v":"A2"},"A2",false,"","E7E6E5","",false,"","D6F6","","","A2",0,{"$f":"IF(P10<>\"\",OFFSET(Logik!$D$4,0,ROW()-1),0)","v":0},"E7E6E5"]
[null,null,null,"R Antal",{"$f":"LEN(E8)/2","v":5},{"$f":"Logik!N1","v":"B2"},"B2",false,"","E7E6E5","",false,"","D6F6","","","B2",0,{"$f":"IF(P11<>\"\",OFFSET(Logik!$D$4,0,ROW()-1),0)","v":0},"E7E6E5"]
[null,null,null,null,null,{"$f":"Logik!O1","v":"C2"},"C2",false,"","E7E6E5","",false,"","D6F6","","","C2",0,{"$f":"IF(P12<>\"\",OFFSET(Logik!$D$4,0,ROW()-1),0)","v":0},"E7E6E5"]
[null,null,null,"MöjligaDrag",{"$f":"T33","v":"E6E5"},{"$f":"Logik!P1","v":"D2"},"D2",false,"","E7E6E5","",false,"","D6F6","","","D2",0,{"$f":"IF(P13<>\"\",OFFSET(Logik!$D$4,0,ROW()-1),0)","v":0},"E7E6E5"]
[null,null,null,"D Antal",{"$f":"LEN(E13)/2","v":2},{"$f":"Logik!Q1","v":"E2"},"E2",false,"","E7E6E5","",false,"","D6F6","","","E2",0,{"$f":"IF(P14<>\"\",OFFSET(Logik!$D$4,0,ROW()-1),0)","v":0},"E7E6E5"]
[null,null,null,null,null,{"$f":"Logik!R1","v":"F2"},"F2",false,"","E7E6E5","",false,"","D6F6","","","F2",0,{"$f":"IF(P15<>\"\",OFFSET(Logik!$D$4,0,ROW()-1),0)","v":0},"E7E6E5"]
[null,null,null,null,null,{"$f":"Logik!S1","v":"G2"},"G2",false,"","E7E6E5","",false,"","D6F6","","","G2",0,{"$f":"IF(P16<>\"\",OFFSET(Logik!$D$4,0,ROW()-1),0)","v":0},"E7E6E5"]
[null,null,null,null,null,{"$f":"Logik!T1","v":"H2"},"H2",false,"","E7E6E5","",false,"","D6F6","","","H2",0,{"$f":"IF(P17<>\"\",OFFSET(Logik!$D$4,0,ROW()-1),0)","v":0},"E7E6E5"]
[null,null,null,null,null,{"$f":"Logik!U1","v":"A7"},"A7",false,"","E7E6E5","",false,"","D6F6","","","A7",{"$f":"IF(P18<>\"\",HLOOKUP(HLOOKUP(Q18,PjasStart,2,FALSE),Pjaser,4,FALSE),0)","v":0},{"$f":"IF(P18<>\"\",OFFSET(Logik!$D$4,0,ROW()-1),0)","v":0},{"$f":"SUBSTITUTE(T17,G18,\"\")","v":"E7E6E5"}]
[null,null,null,null,null,{"$f":"Logik!V1","v":"B7"},"B7",false,"","E7E6E5","",false,"","D6F6","","","B7",0,{"$f":"IF(P19<>\"\",OFFSET(Logik!$D$4,0,ROW()-1),0)","v":0},{"$f":"SUBSTITUTE(T18,G19,\"\")","v":"E7E6E5"}]
[null,null,null,null,null,{"$f":"Logik!W1","v":"C7"},"C7",false,"","E7E6E5","",false,"","D6F6","","","C7",0,{"$f":"IF(P20<>\"\",OFFSET(Logik!$D$4,0,ROW()-1),0)","v":0},{"$f":"SUBSTITUTE(T19,G20,\"\")","v":"E7E6E5"}]
[null,null,null,null,null,{"$f":"Logik!X1","v":"D7"},"D7",false,"","E7E6E5","",false,"","D6F6","","","D7",0,{"$f":"IF(P21<>\"\",OFFSET(Logik!$D$4,0,ROW()-1),0)","v":0},"E7E6E5"]
[null,null,null,null,null,{"$f":"Logik!Y1","v":"E7"},"E7",false,"","E7E6E5","",false,"","D6F6","","","E7",0,{"$f":"IF(P22<>\"\",OFFSET(Logik!$D$4,0,ROW()-1),0)","v":0},"E6E5"]
[null,null,null,null,null,{"$f":"Logik!Z1","v":"F7"},"F7",false,"","E7E6E5","",false,"","D6F6","","","F7",0,{"$f":"IF(P23<>\"\",OFFSET(Logik!$D$4,0,ROW()-1),0)","v":0},"E6E5"]
[null,null,null,null,null,{"$f":"Logik!AA1","v":"G7"},"G7",false,"","E7E6E5","",false,"","D6F6","","","G7",0,{"$f":"IF(P24<>\"\",OFFSET(Logik!$D$4,0,ROW()-1),0)","v":0},"E6E5"]
[null,null,null,null,null,{"$f":"Logik!AB1","v":"H7"},"H7",false,"","E7E6E5","",false,"","D6F6","","","H7",0,{"$f":"IF(P25<>\"\",OFFSET(Logik!$D$4,0,ROW()-1),0)","v":0},"E6E5"]
[null,null,null,null,null,{"$f":"Logik!AC1","v":"A8"},"A8",false,"","E7E6E5","",false,"","D6F6","","","A8",0,{"$f":"IF(P26<>\"\",OFFSET(Logik!$D$4,0,ROW()-1),0)","v":0},"E6E5"]
[null,null,null,null,null,{"$f":"Logik!AD1","v":"B8"},"B8",false,"","E7E6E5","",false,"","D6F6","","","B8",0,{"$f":"IF(P27<>\"\",OFFSET(Logik!$D$4,0,ROW()-1),0)","v":0},"E6E5"]
[null,null,null,null,null,{"$f":"Logik!AE1","v":"C8"},"C8",false,"","E7E6E5","",false,"","D6F6","","","C8",0,{"$f":"IF(P28<>\"\",OFFSET(Logik!$D$4,0,ROW()-1),0)","v":0},"E6E5"]
[null,null,null,null,null,{"$f":"Logik!AF1","v":"D8"},"D8",false,"","E7E6E5","",false,"","D6F6","","","D8",0,{"$f":"IF(P29<>\"\",OFFSET(Logik!$D$4,0,ROW()-1),0)","v":0},"E6E5"]
[null,null,null,null,null,{"$f":"Logik!AG1","v":"E8"},"E8",false,"","E7E6E5","",false,"","D6F6","","","E8",0,{"$f":"IF(P30<>\"\",OFFSET(Logik!$D$4,0,ROW()-1),0)","v":0},"E6E5"]
[null,null,null,null,null,{"$f":"Logik!AH1","v":"F8"},"F8",false,"","E7E6E5","",false,"","D6F6","","","F8",0,{"$f":"IF(P31<>\"\",OFFSET(Logik!$D$4,0,ROW()-1),0)","v":0},"E6E5"]
[null,null,null,null,null,{"$f":"Logik!AI1","v":"G8"},"G8",false,"","E7E6E5","",false,"","D6F6","","","G8",0,{"$f":"IF(P32<>\"\",OFFSET(Logik!$D$4,0,ROW()-1),0)","v":0},"E6E5"]
[null,null,null,null,null,{"$f":"Logik!AJ1","v":"H8"},"H8",false,"","E7E6E5","",false,"","D6F6","","","H8",0,{"$f":"IF(P33<>\"\",OFFSET(Logik!$D$4,0,ROW()-1),0)","v":0},"E6E5"]

{"sheet":"P_F7","index":42,"n_rows":33,"n_cols":20,"rows_kept":33,"cut":false,"hidden":true,"merged":[]}
[null,null,null,null,null,{"$f":"Logik!D1","v":"Pos:"},"Pjäs:","Fräckvidd","Pos",{"$f":"RIGHT($E$2,LEN($E$2)-$E$4+1)","v":"F7F6F5"},{"$f":"LEFT($E$2,$E$4-1)","v":""},"Aräckvidd",null,{"$f":"RIGHT($E$3,LEN($E$3)-$E$5+1)","v":"E6G6"},{"$f":"IF(E5=0,\"\",(LEFT($E$3,$E$5-1)))","v":""},"Nåbar","Vad","Poäng","PosPoäng","MöjligaDrag"]
["Pjäs:",{"$f":"Logik!Z2","v":"F7"},null,"FRäckvidd",{"$f":"IFERROR(INDEX(tblRVB,MATCH(\"SB\"&$B$3,RVB!$A$2:$A$120,0),5),\"\")","v":"F7F6F5"},{"$f":"UPPER(Logik!E1)","v":"A1"},{"$f":"UPPER(F2)","v":"A1"},{"$f":"IF($G2<>\"\",IF($G2<>$B$3,IF(IFERROR(FIND($G2,$E$2)>0,FALSE),TRUE,FALSE),FALSE),FALSE)","v":false},{"$f":"IF(H2,FIND($G2,$E$2),\"\")","v":""},{"$f":"IF(AND(I2<>\"\",I2>0,I2>$E$4),LEFT(J1,MIN(I2-$E$4+2,LEN(J1))),J1)","v":"F7F6F5"},{"$f":"IF(AND($G2<>\"\",$G2>0,$I2<$E$4),RIGHT(K1,MIN($E$4-$I2,LEN(K1))),K1)","v":""},{"$f":"IF($G2<>\"\",IF($G2<>$B$3,IF(IFERROR(FIND($G2,$E$3)>0,FALSE),TRUE,FALSE),FALSE),FALSE)","v":false},{"$f":"IF(L2,FIND($G2,$E$3),\"\")","v":""},{"$f":"IF(AND(M2<>\"\",M2>0,M2>$E$5),LEFT(N1,MIN(M2-$E$5+3,LEN(N1))),N1)","v":"E6G6"},{"$f":"IF(AND($G2<>\"\",$G2>0,M2<$E$5),RIGHT(O1,MIN($E$5-M2,LEN(O1))),O1)","v":""},{"$f":"IFERROR(IF(AND(G2<>\"\",$G2<>$B$3),FIND(G2,$E$7),\"\"),\"\")","v":""},"A1",{"$f":"IF(P2<>\"\",HLOOKUP(HLOOKUP(Q2,PjasStart,2,FALSE),Pjaser,3,FALSE),0)","v":0},{"$f":"IF(P2<>\"\",OFFSET(Logik!$D$4,0,ROW()-1),0)","v":0},{"$f":"SUBSTITUTE(E6,G2,\"\")&IF(IFERROR(FIND(G2,N2)>0,FALSE),G2,\"\")","v":"F7F6F5"}]
["Pos:",{"$f":"UPPER(Logik!Z1)","v":"F7"},null,"Aräckvidd",{"$f":"IFERROR(INDEX(tblRVB,MATCH(\"SB\"&$B$3,RVB!$A$2:$A$120,0),6),\"\")","v":"E6G6"},{"$f":"Logik!F1","v":"B1"},{"$f":"UPPER(F3)","v":"B1"},{"$f":"IF($G3<>\"\",IF($G3<>$B$3,IF(IFERROR(FIND($G3,$E$2)>0,FALSE),TRUE,FALSE),FALSE),FALSE)","v":false},{"$f":"IF(H3,FIND($G3,$E$2),\"\")","v":""},{"$f":"IF(AND(I3<>\"\",I3>0,I3>$E$4),LEFT(J2,MIN(I3-$E$4+2,LEN(J2))),J2)","v":"F7F6F5"},{"$f":"IF(AND($G3<>\"\",$G3>0,$I3<$E$4),RIGHT(K2,MIN($E$4-$I3,LEN(K2))),K2)","v":""},{"$f":"IF($G3<>\"\",IF($G3<>$B$3,IF(IFERROR(FIND($G3,$E$3)>0,FALSE),TRUE,FALSE),FALSE),FALSE)","v":false},{"$f":"IF(L3,FIND($G3,$E$3),\"\")","v":""},{"$f":"IF(AND(M3<>\"\",M3>0,M3>$E$5),LEFT(N2,MIN(M3-$E$5+3,LEN(N2))),N2)","v":"E6G6"},{"$f":"IF(AND($G3<>\"\",$G3>0,M3<$E$5),RIGHT(O2,MIN($E$5-M3,LEN(O2))),O2)","v":""},{"$f":"IFERROR(IF(AND(G3<>\"\",$G3<>$B$3),FIND(G3,$E$7),\"\"),\"\")","v":""},"B1",0,{"$f":"IF(P3<>\"\",OFFSET(Logik!$D$4,0,ROW()-1),0)","v":0},{"$f":"SUBSTITUTE(T2,G3,\"\")&IF(IFERROR(FIND(G3,N3)>0,FALSE),G3,\"\")","v":"F7F6F5"}]
["PosX:",{"$f":"LEFT(B3,1)","v":"F"},null,"PosX",{"$f":"FIND(B3,E2)","v":1},{"$f":"Logik!G1","v":"C1"},"C1",false,"","F7F6F5","",false,"","E6G6","","","C1",0,{"$f":"IF(P4<>\"\",OFFSET(Logik!$D$4,0,ROW()-1),0)","v":0},{"$f":"SUBSTITUTE(T3,G4,\"\")&IF(IFERROR(FIND(G4,N4)>0,FALSE),G4,\"\")","v":"F7F6F5"}]
["PosY:",{"$f":"RIGHT(B3,1)","v":"7"},null,"PosY",{"$f":"IFERROR(FIND(B3,E3),0)","v":0},{"$f":"Logik!H1","v":"D1"},"D1",false,"","F7F6F5","",false,"","E6G6","","","D1",0,{"$f":"IF(P5<>\"\",OFFSET(Logik!$D$4,0,ROW()-1),0)","v":0},"F7F6F5"]
[null,null,null,"RX",{"$f":"K33&J33","v":"F7F6F5"},{"$f":"Logik!I1","v":"E1"},"E1",false,"","F7F6F5","",false,"","E6G6","","","E1",0,{"$f":"IF(P6<>\"\",OFFSET(Logik!$D$4,0,ROW()-1),0)","v":0},"F7F6F5"]
["Poäng",{"$f":"Logik!Z3","v":100},null,"RA",{"$f":"O33&N33","v":"E6G6"},{"$f":"Logik!J1","v":"F1"},"F1",false,"","F7F6F5","",false,"","E6G6","","","F1",0,{"$f":"IF(P7<>\"\",OFFSET(Logik!$D$4,0,ROW()-1),0)","v":0},"F7F6F5"]
["PosPoäng",{"$f":"Logik!Z4","v":0},null,"RXY",{"$f":"E6&E7","v":"F7F6F5E6G6"},{"$f":"Logik!K1","v":"G1"},"G1",false,"","F7F6F5","",false,"","E6G6","","","G1",0,{"$f":"IF(P8<>\"\",OFFSET(Logik!$D$4,0,ROW()-1),0)","v":0},"F7F6F5"]
[null,null,null,"Försvar",{"$f":"SUM(R18:R33)+SUM(S18:S33)","v":0},{"$f":"Logik!L1","v":"H1"},"H1",false,"","F7F6F5","",false,"","E6G6","","","H1",0,{"$f":"IF(P9<>\"\",OFFSET(Logik!$D$4,0,ROW()-1),0)","v":0},"F7F6F5"]
[null,null,null,"Attack",{"$f":"SUM(R2:R17)+SUM(S2:S17)","v":0},{"$f":"Logik!M1","v":"A2"},"A2",false,"","F7F6F5","",false,"","E6G6","","","A2",0,{"$f":"IF(P10<>\"\",OFFSET(Logik!$D$4,0,ROW()-1),0)","v":0},"F7F6F5"]
[null,null,null,"R Antal",{"$f":"LEN(E8)/2","v":5},{"$f":"Logik!N1","v":"B2"},"B2",false,"","F7F6F5","",false,"","E6G6","","","B2",0,{"$f":"IF(P11<>\"\",OFFSET(Logik!$D$4,0,ROW()-1),0)","v":0},"F7F6F5"]
[null,null,null,null,null,{"$f":"Logik!O1","v":"C2"},"C2",false,"","F7F6F5","",false,"","E6G6","","","C2",0,{"$f":"IF(P12<>\"\",OFFSET(Logik!$D$4,0,ROW()-1),0)","v":0},"F7F6F5"]
[null,null,null,"MöjligaDrag",{"$f":"T33","v":"F6F5"},{"$f":"Logik!P1","v":"D2"},"D2",false,"","F7F6F5","",false,"","E6G6","","","D2",0,{"$f":"IF(P13<>\"\",OFFSET(Logik!$D$4,0,ROW()-1),0)","v":0},"F7F6F5"]
[null,null,null,"D Antal",{"$f":"LEN(E13)/2","v":2},{"$f":"Logik!Q1","v":"E2"},"E2",false,"","F7F6F5","",false,"","E6G6","","","E2",0,{"$f":"IF(P14<>\"\",OFFSET(Logik!$D$4,0,ROW()-1),0)","v":0},"F7F6F5"]
[null,null,null,null,null,{"$f":"Logik!R1","v":"F2"},"F2",false,"","F7F6F5","",false,"","E6G6","","","F2",0,{"$f":"IF(P15<>\"\",OFFSET(Logik!$D$4,0,ROW()-1),0)","v":0},"F7F6F5"]
[null,null,null,null,null,{"$f":"Logik!S1","v":"G2"},"G2",false,"","F7F6F5","",false,"","E6G6","","","G2",0,{"$f":"IF(P16<>\"\",OFFSET(Logik!$D$4,0,ROW()-1),0)","v":0},"F7F6F5"]
[null,null,null,null,null,{"$f":"Logik!T1","v":"H2"},"H2",false,"","F7F6F5","",false,"","E6G6","","","H2",0,{"$f":"IF(P17<>\"\",OFFSET(Logik!$D$4,0,ROW()-1),0)","v":0},"F7F6F5"]
[null,null,null,null,null,{"$f":"Logik!U1","v":"A7"},"A7",false,"","F7F6F5","",false,"","E6G6","","","A7",{"$f":"IF(P18<>\"\",HLOOKUP(HLOOKUP(Q18,PjasStart,2,FALSE),Pjaser,4,FALSE),0)","v":0},{"$f":"IF(P18<>\"\",OFFSET(Logik!$D$4,0,ROW()-1),0)","v":0},{"$f":"SUBSTITUTE(T17,G18,\"\")","v":"F7F6F5"}]
[null,null,null,null,null,{"$f":"Logik!V1","v":"B7"},"B7",false,"","F7F6F5","",false,"","E6G6","","","B7",0,{"$f":"IF(P19<>\"\",OFFSET(Logik!$D$4,0,ROW()-1),0)","v":0},{"$f":"SUBSTITUTE(T18,G19,\"\")","v":"F7F6F5"}]
[null,null,null,null,null,{"$f":"Logik!W1","v":"C7"},"C7",false,"","F7F6F5","",false,"","E6G6","","","C7",0,{"$f":"IF(P20<>\"\",OFFSET(Logik!$D$4,0,ROW()-1),0)","v":0},{"$f":"SUBSTITUTE(T19,G20,\"\")","v":"F7F6F5"}]
[null,null,null,null,null,{"$f":"Logik!X1","v":"D7"},"D7",false,"","F7F6F5","",false,"","E6G6","","","D7",0,{"$f":"IF(P21<>\"\",OFFSET(Logik!$D$4,0,ROW()-1),0)","v":0},"F7F6F5"]
[null,null,null,null,null,{"$f":"Logik!Y1","v":"E7"},"E7",false,"","F7F6F5","",false,"","E6G6","","","E7",0,{"$f":"IF(P22<>\"\",OFFSET(Logik!$D$4,0,ROW()-1),0)","v":0},"F7F6F5"]
[null,null,null,null,null,{"$f":"Logik!Z1","v":"F7"},"F7",false,"","F7F6F5","",false,"","E6G6","","","F7",0,{"$f":"IF(P23<>\"\",OFFSET(Logik!$D$4,0,ROW()-1),0)","v":0},"F6F5"]
[null,null,null,null,null,{"$f":"Logik!AA1","v":"G7"},"G7",false,"","F7F6F5","",false,"","E6G6","","","G7",0,{"$f":"IF(P24<>\"\",OFFSET(Logik!$D$4,0,ROW()-1),0)","v":0},"F6F5"]
[null,null,null,null,null,{"$f":"Logik!AB1","v":"H7"},"H7",false,"","F7F6F5","",false,"","E6G6","","","H7",0,{"$f":"IF(P25<>\"\",OFFSET(Logik!$D$4,0,ROW()-1),0)","v":0},"F6F5"]
[null,null,null,null,null,{"$f":"Logik!AC1","v":"A8"},"A8",false,"","F7F6F5","",false,"","E6G6","","","A8",0,{"$f":"IF(P26<>\"\",OFFSET(Logik!$D$4,0,ROW()-1),0)","v":0},"F6F5"]
[null,null,null,null,null,{"$f":"Logik!AD1","v":"B8"},"B8",false,"","F7F6F5","",false,"","E6G6","","","B8",0,{"$f":"IF(P27<>\"\",OFFSET(Logik!$D$4,0,ROW()-1),0)","v":0},"F6F5"]
[null,null,null,null,null,{"$f":"Logik!AE1","v":"C8"},"C8",false,"","F7F6F5","",false,"","E6G6","","","C8",0,{"$f":"IF(P28<>\"\",OFFSET(Logik!$D$4,0,ROW()-1),0)","v":0},"F6F5"]
[null,null,null,null,null,{"$f":"Logik!AF1","v":"D8"},"D8",false,"","F7F6F5","",false,"","E6G6","","","D8",0,{"$f":"IF(P29<>\"\",OFFSET(Logik!$D$4,0,ROW()-1),0)","v":0},"F6F5"]
[null,null,null,null,null,{"$f":"Logik!AG1","v":"E8"},"E8",false,"","F7F6F5","",false,"","E6G6","","","E8",0,{"$f":"IF(P30<>\"\",OFFSET(Logik!$D$4,0,ROW()-1),0)","v":0},"F6F5"]
[null,null,null,null,null,{"$f":"Logik!AH1","v":"F8"},"F8",false,"","F7F6F5","",false,"","E6G6","","","F8",0,{"$f":"IF(P31<>\"\",OFFSET(Logik!$D$4,0,ROW()-1),0)","v":0},"F6F5"]
[null,null,null,null,null,{"$f":"Logik!AI1","v":"G8"},"G8",false,"","F7F6F5","",false,"","E6G6","","","G8",0,{"$f":"IF(P32<>\"\",OFFSET(Logik!$D$4,0,ROW()-1),0)","v":0},"F6F5"]
[null,null,null,null,null,{"$f":"Logik!AJ1","v":"H8"},"H8",false,"","F7F6F5","",false,"","E6G6","","","H8",0,{"$f":"IF(P33<>\"\",OFFSET(Logik!$D$4,0,ROW()-1),0)","v":0},"F6F5"]

{"sheet":"P_G7","index":43,"n_rows":33,"n_cols":20,"rows_kept":33,"cut":false,"hidden":true,"merged":[]}
[null,null,null,null,null,{"$f":"Logik!D1","v":"Pos:"},"Pjäs:","Fräckvidd","Pos",{"$f":"RIGHT($E$2,LEN($E$2)-$E$4+1)","v":"G7G6G5"},{"$f":"LEFT($E$2,$E$4-1)","v":""},"Aräckvidd",null,{"$f":"RIGHT($E$3,LEN($E$3)-$E$5+1)","v":"F6H6"},{"$f":"IF(E5=0,\"\",(LEFT($E$3,$E$5-1)))","v":""},"Nåbar","Vad","Poäng","PosPoäng","MöjligaDrag"]
["Pjäs:",{"$f":"Logik!AA2","v":"G7"},null,"FRäckvidd",{"$f":"IFERROR(INDEX(tblRVB,MATCH(\"SB\"&$B$3,RVB!$A$2:$A$120,0),5),\"\")","v":"G7G6G5"},{"$f":"UPPER(Logik!E1)","v":"A1"},{"$f":"UPPER(F2)","v":"A1"},{"$f":"IF($G2<>\"\",IF($G2<>$B$3,IF(IFERROR(FIND($G2,$E$2)>0,FALSE),TRUE,FALSE),FALSE),FALSE)","v":false},{"$f":"IF(H2,FIND($G2,$E$2),\"\")","v":""},{"$f":"IF(AND(I2<>\"\",I2>0,I2>$E$4),LEFT(J1,MIN(I2-$E$4+2,LEN(J1))),J1)","v":"G7G6G5"},{"$f":"IF(AND($G2<>\"\",$G2>0,$I2<$E$4),RIGHT(K1,MIN($E$4-$I2,LEN(K1))),K1)","v":""},{"$f":"IF($G2<>\"\",IF($G2<>$B$3,IF(IFERROR(FIND($G2,$E$3)>0,FALSE),TRUE,FALSE),FALSE),FALSE)","v":false},{"$f":"IF(L2,FIND($G2,$E$3),\"\")","v":""},{"$f":"IF(AND(M2<>\"\",M2>0,M2>$E$5),LEFT(N1,MIN(M2-$E$5+3,LEN(N1))),N1)","v":"F6H6"},{"$f":"IF(AND($G2<>\"\",$G2>0,M2<$E$5),RIGHT(O1,MIN($E$5-M2,LEN(O1))),O1)","v":""},{"$f":"IFERROR(IF(AND(G2<>\"\",$G2<>$B$3),FIND(G2,$E$7),\"\"),\"\")","v":""},"A1",{"$f":"IF(P2<>\"\",HLOOKUP(HLOOKUP(Q2,PjasStart,2,FALSE),Pjaser,3,FALSE),0)","v":0},{"$f":"IF(P2<>\"\",OFFSET(Logik!$D$4,0,ROW()-1),0)","v":0},{"$f":"SUBSTITUTE(E6,G2,\"\")&IF(IFERROR(FIND(G2,N2)>0,FALSE),G2,\"\")","v":"G7G6G5"}]
["Pos:",{"$f":"UPPER(Logik!AA1)","v":"G7"},null,"Aräckvidd",{"$f":"IFERROR(INDEX(tblRVB,MATCH(\"SB\"&$B$3,RVB!$A$2:$A$120,0),6),\"\")","v":"F6H6"},{"$f":"Logik!F1","v":"B1"},{"$f":"UPPER(F3)","v":"B1"},{"$f":"IF($G3<>\"\",IF($G3<>$B$3,IF(IFERROR(FIND($G3,$E$2)>0,FALSE),TRUE,FALSE),FALSE),FALSE)","v":false},{"$f":"IF(H3,FIND($G3,$E$2),\"\")","v":""},{"$f":"IF(AND(I3<>\"\",I3>0,I3>$E$4),LEFT(J2,MIN(I3-$E$4+2,LEN(J2))),J2)","v":"G7G6G5"},{"$f":"IF(AND($G3<>\"\",$G3>0,$I3<$E$4),RIGHT(K2,MIN($E$4-$I3,LEN(K2))),K2)","v":""},{"$f":"IF($G3<>\"\",IF($G3<>$B$3,IF(IFERROR(FIND($G3,$E$3)>0,FALSE),TRUE,FALSE),FALSE),FALSE)","v":false},{"$f":"IF(L3,FIND($G3,$E$3),\"\")","v":""},{"$f":"IF(AND(M3<>\"\",M3>0,M3>$E$5),LEFT(N2,MIN(M3-$E$5+3,LEN(N2))),N2)","v":"F6H6"},{"$f":"IF(AND($G3<>\"\",$G3>0,M3<$E$5),RIGHT(O2,MIN($E$5-M3,LEN(O2))),O2)","v":""},{"$f":"IFERROR(IF(AND(G3<>\"\",$G3<>$B$3),FIND(G3,$E$7),\"\"),\"\")","v":""},"B1",0,{"$f":"IF(P3<>\"\",OFFSET(Logik!$D$4,0,ROW()-1),0)","v":0},{"$f":"SUBSTITUTE(T2,G3,\"\")&IF(IFERROR(FIND(G3,N3)>0,FALSE),G3,\"\")","v":"G7G6G5"}]
["PosX:",{"$f":"LEFT(B3,1)","v":"G"},null,"PosX",{"$f":"FIND(B3,E2)","v":1},{"$f":"Logik!G1","v":"C1"},"C1",false,"","G7G6G5","",false,"","F6H6","","","C1",0,{"$f":"IF(P4<>\"\",OFFSET(Logik!$D$4,0,ROW()-1),0)","v":0},{"$f":"SUBSTITUTE(T3,G4,\"\")&IF(IFERROR(FIND(G4,N4)>0,FALSE),G4,\"\")","v":"G7G6G5"}]
["PosY:",{"$f":"RIGHT(B3,1)","v":"7"},null,"PosY",{"$f":"IFERROR(FIND(B3,E3),0)","v":0},{"$f":"Logik!H1","v":"D1"},"D1",false,"","G7G6G5","",false,"","F6H6","","","D1",0,{"$f":"IF(P5<>\"\",OFFSET(Logik!$D$4,0,ROW()-1),0)","v":0},"G7G6G5"]
[null,null,null,"RX",{"$f":"K33&J33","v":"G7G6G5"},{"$f":"Logik!I1","v":"E1"},"E1",false,"","G7G6G5","",false,"","F6H6","","","E1",0,{"$f":"IF(P6<>\"\",OFFSET(Logik!$D$4,0,ROW()-1),0)","v":0},"G7G6G5"]
["Poäng",{"$f":"Logik!AA3","v":100},null,"RA",{"$f":"O33&N33","v":"F6H6"},{"$f":"Logik!J1","v":"F1"},"F1",false,"","G7G6G5","",false,"","F6H6","","","F1",0,{"$f":"IF(P7<>\"\",OFFSET(Logik!$D$4,0,ROW()-1),0)","v":0},"G7G6G5"]
["PosPoäng",{"$f":"Logik!AA4","v":0},null,"RXY",{"$f":"E6&E7","v":"G7G6G5F6H6"},{"$f":"Logik!K1","v":"G1"},"G1",false,"","G7G6G5","",false,"","F6H6","","","G1",0,{"$f":"IF(P8<>\"\",OFFSET(Logik!$D$4,0,ROW()-1),0)","v":0},"G7G6G5"]
[null,null,null,"Försvar",{"$f":"SUM(R18:R33)+SUM(S18:S33)","v":0},{"$f":"Logik!L1","v":"H1"},"H1",false,"","G7G6G5","",false,"","F6H6","","","H1",0,{"$f":"IF(P9<>\"\",OFFSET(Logik!$D$4,0,ROW()-1),0)","v":0},"G7G6G5"]
[null,null,null,"Attack",{"$f":"SUM(R2:R17)+SUM(S2:S17)","v":0},{"$f":"Logik!M1","v":"A2"},"A2",false,"","G7G6G5","",false,"","F6H6","","","A2",0,{"$f":"IF(P10<>\"\",OFFSET(Logik!$D$4,0,ROW()-1),0)","v":0},"G7G6G5"]
[null,null,null,"R Antal",{"$f":"LEN(E8)/2","v":5},{"$f":"Logik!N1","v":"B2"},"B2",false,"","G7G6G5","",false,"","F6H6","","","B2",0,{"$f":"IF(P11<>\"\",OFFSET(Logik!$D$4,0,ROW()-1),0)","v":0},"G7G6G5"]
[null,null,null,null,null,{"$f":"Logik!O1","v":"C2"},"C2",false,"","G7G6G5","",false,"","F6H6","","","C2",0,{"$f":"IF(P12<>\"\",OFFSET(Logik!$D$4,0,ROW()-1),0)","v":0},"G7G6G5"]
[null,null,null,"MöjligaDrag",{"$f":"T33","v":"G6G5"},{"$f":"Logik!P1","v":"D2"},"D2",false,"","G7G6G5","",false,"","F6H6","","","D2",0,{"$f":"IF(P13<>\"\",OFFSET(Logik!$D$4,0,ROW()-1),0)","v":0},"G7G6G5"]
[null,null,null,"D Antal",{"$f":"LEN(E13)/2","v":2},{"$f":"Logik!Q1","v":"E2"},"E2",false,"","G7G6G5","",false,"","F6H6","","","E2",0,{"$f":"IF(P14<>\"\",OFFSET(Logik!$D$4,0,ROW()-1),0)","v":0},"G7G6G5"]
[null,null,null,null,null,{"$f":"Logik!R1","v":"F2"},"F2",false,"","G7G6G5","",false,"","F6H6","","","F2",0,{"$f":"IF(P15<>\"\",OFFSET(Logik!$D$4,0,ROW()-1),0)","v":0},"G7G6G5"]
[null,null,null,null,null,{"$f":"Logik!S1","v":"G2"},"G2",false,"","G7G6G5","",false,"","F6H6","","","G2",0,{"$f":"IF(P16<>\"\",OFFSET(Logik!$D$4,0,ROW()-1),0)","v":0},"G7G6G5"]
[null,null,null,null,null,{"$f":"Logik!T1","v":"H2"},"H2",false,"","G7G6G5","",false,"","F6H6","","","H2",0,{"$f":"IF(P17<>\"\",OFFSET(Logik!$D$4,0,ROW()-1),0)","v":0},"G7G6G5"]
[null,null,null,null,null,{"$f":"Logik!U1","v":"A7"},"A7",false,"","G7G6G5","",false,"","F6H6","","","A7",{"$f":"IF(P18<>\"\",HLOOKUP(HLOOKUP(Q18,PjasStart,2,FALSE),Pjaser,4,FALSE),0)","v":0},{"$f":"IF(P18<>\"\",OFFSET(Logik!$D$4,0,ROW()-1),0)","v":0},{"$f":"SUBSTITUTE(T17,G18,\"\")","v":"G7G6G5"}]
[null,null,null,null,null,{"$f":"Logik!V1","v":"B7"},"B7",false,"","G7G6G5","",false,"","F6H6","","","B7",0,{"$f":"IF(P19<>\"\",OFFSET(Logik!$D$4,0,ROW()-1),0)","v":0},{"$f":"SUBSTITUTE(T18,G19,\"\")","v":"G7G6G5"}]
[null,null,null,null,null,{"$f":"Logik!W1","v":"C7"},"C7",false,"","G7G6G5","",false,"","F6H6","","","C7",0,{"$f":"IF(P20<>\"\",OFFSET(Logik!$D$4,0,ROW()-1),0)","v":0},{"$f":"SUBSTITUTE(T19,G20,\"\")","v":"G7G6G5"}]
[null,null,null,null,null,{"$f":"Logik!X1","v":"D7"},"D7",false,"","G7G6G5","",false,"","F6H6","","","D7",0,{"$f":"IF(P21<>\"\",OFFSET(Logik!$D$4,0,ROW()-1),0)","v":0},"G7G6G5"]
[null,null,null,null,null,{"$f":"Logik!Y1","v":"E7"},"E7",false,"","G7G6G5","",false,"","F6H6","","","E7",0,{"$f":"IF(P22<>\"\",OFFSET(Logik!$D$4,0,ROW()-1),0)","v":0},"G7G6G5"]
[null,null,null,null,null,{"$f":"Logik!Z1","v":"F7"},"F7",false,"","G7G6G5","",false,"","F6H6","","","F7",0,{"$f":"IF(P23<>\"\",OFFSET(Logik!$D$4,0,ROW()-1),0)","v":0},"G7G6G5"]
[null,null,null,null,null,{"$f":"Logik!AA1","v":"G7"},"G7",false,"","G7G6G5","",false,"","F6H6","","","G7",0,{"$f":"IF(P24<>\"\",OFFSET(Logik!$D$4,0,ROW()-1),0)","v":0},"G6G5"]
[null,null,null,null,null,{"$f":"Logik!AB1","v":"H7"},"H7",false,"","G7G6G5","",false,"","F6H6","","","H7",0,{"$f":"IF(P25<>\"\",OFFSET(Logik!$D$4,0,ROW()-1),0)","v":0},"G6G5"]
[null,null,null,null,null,{"$f":"Logik!AC1","v":"A8"},"A8",false,"","G7G6G5","",false,"","F6H6","","","A8",0,{"$f":"IF(P26<>\"\",OFFSET(Logik!$D$4,0,ROW()-1),0)","v":0},"G6G5"]
[null,null,null,null,null,{"$f":"Logik!AD1","v":"B8"},"B8",false,"","G7G6G5","",false,"","F6H6","","","B8",0,{"$f":"IF(P27<>\"\",OFFSET(Logik!$D$4,0,ROW()-1),0)","v":0},"G6G5"]
[null,null,null,null,null,{"$f":"Logik!AE1","v":"C8"},"C8",false,"","G7G6G5","",false,"","F6H6","","","C8",0,{"$f":"IF(P28<>\"\",OFFSET(Logik!$D$4,0,ROW()-1),0)","v":0},"G6G5"]
[null,null,null,null,null,{"$f":"Logik!AF1","v":"D8"},"D8",false,"","G7G6G5","",false,"","F6H6","","","D8",0,{"$f":"IF(P29<>\"\",OFFSET(Logik!$D$4,0,ROW()-1),0)","v":0},"G6G5"]
[null,null,null,null,null,{"$f":"Logik!AG1","v":"E8"},"E8",false,"","G7G6G5","",false,"","F6H6","","","E8",0,{"$f":"IF(P30<>\"\",OFFSET(Logik!$D$4,0,ROW()-1),0)","v":0},"G6G5"]
[null,null,null,null,null,{"$f":"Logik!AH1","v":"F8"},"F8",false,"","G7G6G5","",false,"","F6H6","","","F8",0,{"$f":"IF(P31<>\"\",OFFSET(Logik!$D$4,0,ROW()-1),0)","v":0},"G6G5"]
[null,null,null,null,null,{"$f":"Logik!AI1","v":"G8"},"G8",false,"","G7G6G5","",false,"","F6H6","","","G8",0,{"$f":"IF(P32<>\"\",OFFSET(Logik!$D$4,0,ROW()-1),0)","v":0},"G6G5"]
[null,null,null,null,null,{"$f":"Logik!AJ1","v":"H8"},"H8",false,"","G7G6G5","",false,"","F6H6","","","H8",0,{"$f":"IF(P33<>\"\",OFFSET(Logik!$D$4,0,ROW()-1),0)","v":0},"G6G5"]

{"sheet":"P_H7","index":44,"n_rows":33,"n_cols":20,"rows_kept":33,"cut":false,"hidden":true,"merged":[]}
[null,null,null,null,null,{"$f":"Logik!D1","v":"Pos:"},"Pjäs:","Fräckvidd","Pos",{"$f":"RIGHT($E$2,LEN($E$2)-$E$4+1)","v":"H7H6H5"},{"$f":"LEFT($E$2,$E$4-1)","v":""},"Aräckvidd",null,{"$f":"RIGHT($E$3,LEN($E$3)-$E$5+1)","v":"G6"},{"$f":"IF(E5=0,\"\",(LEFT($E$3,$E$5-1)))","v":""},"Nåbar","Vad","Poäng","PosPoäng","MöjligaDrag"]
["Pjäs:",{"$f":"Logik!AB2","v":"H7"},null,"FRäckvidd",{"$f":"IFERROR(INDEX(tblRVB,MATCH(\"SB\"&$B$3,RVB!$A$2:$A$120,0),5),\"\")","v":"H7H6H5"},{"$f":"UPPER(Logik!E1)","v":"A1"},{"$f":"UPPER(F2)","v":"A1"},{"$f":"IF($G2<>\"\",IF($G2<>$B$3,IF(IFERROR(FIND($G2,$E$2)>0,FALSE),TRUE,FALSE),FALSE),FALSE)","v":false},{"$f":"IF(H2,FIND($G2,$E$2),\"\")","v":""},{"$f":"IF(AND(I2<>\"\",I2>0,I2>$E$4),LEFT(J1,MIN(I2-$E$4+2,LEN(J1))),J1)","v":"H7H6H5"},{"$f":"IF(AND($G2<>\"\",$G2>0,$I2<$E$4),RIGHT(K1,MIN($E$4-$I2,LEN(K1))),K1)","v":""},{"$f":"IF($G2<>\"\",IF($G2<>$B$3,IF(IFERROR(FIND($G2,$E$3)>0,FALSE),TRUE,FALSE),FALSE),FALSE)","v":false},{"$f":"IF(L2,FIND($G2,$E$3),\"\")","v":""},{"$f":"IF(AND(M2<>\"\",M2>0,M2>$E$5),LEFT(N1,MIN(M2-$E$5+3,LEN(N1))),N1)","v":"G6"},{"$f":"IF(AND($G2<>\"\",$G2>0,M2<$E$5),RIGHT(O1,MIN($E$5-M2,LEN(O1))),O1)","v":""},{"$f":"IFERROR(IF(AND(G2<>\"\",$G2<>$B$3),FIND(G2,$E$7),\"\"),\"\")","v":""},"A1",{"$f":"IF(P2<>\"\",HLOOKUP(HLOOKUP(Q2,PjasStart,2,FALSE),Pjaser,3,FALSE),0)","v":0},{"$f":"IF(P2<>\"\",OFFSET(Logik!$D$4,0,ROW()-1),0)","v":0},{"$f":"SUBSTITUTE(E6,G2,\"\")&IF(IFERROR(FIND(G2,N2)>0,FALSE),G2,\"\")","v":"H7H6H5"}]
["Pos:",{"$f":"UPPER(Logik!AB1)","v":"H7"},null,"Aräckvidd",{"$f":"IFERROR(INDEX(tblRVB,MATCH(\"SB\"&$B$3,RVB!$A$2:$A$120,0),6),\"\")","v":"G6"},{"$f":"Logik!F1","v":"B1"},{"$f":"UPPER(F3)","v":"B1"},{"$f":"IF($G3<>\"\",IF($G3<>$B$3,IF(IFERROR(FIND($G3,$E$2)>0,FALSE),TRUE,FALSE),FALSE),FALSE)","v":false},{"$f":"IF(H3,FIND($G3,$E$2),\"\")","v":""},{"$f":"IF(AND(I3<>\"\",I3>0,I3>$E$4),LEFT(J2,MIN(I3-$E$4+2,LEN(J2))),J2)","v":"H7H6H5"},{"$f":"IF(AND($G3<>\"\",$G3>0,$I3<$E$4),RIGHT(K2,MIN($E$4-$I3,LEN(K2))),K2)","v":""},{"$f":"IF($G3<>\"\",IF($G3<>$B$3,IF(IFERROR(FIND($G3,$E$3)>0,FALSE),TRUE,FALSE),FALSE),FALSE)","v":false},{"$f":"IF(L3,FIND($G3,$E$3),\"\")","v":""},{"$f":"IF(AND(M3<>\"\",M3>0,M3>$E$5),LEFT(N2,MIN(M3-$E$5+3,LEN(N2))),N2)","v":"G6"},{"$f":"IF(AND($G3<>\"\",$G3>0,M3<$E$5),RIGHT(O2,MIN($E$5-M3,LEN(O2))),O2)","v":""},{"$f":"IFERROR(IF(AND(G3<>\"\",$G3<>$B$3),FIND(G3,$E$7),\"\"),\"\")","v":""},"B1",0,{"$f":"IF(P3<>\"\",OFFSET(Logik!$D$4,0,ROW()-1),0)","v":0},{"$f":"SUBSTITUTE(T2,G3,\"\")&IF(IFERROR(FIND(G3,N3)>0,FALSE),G3,\"\")","v":"H7H6H5"}]
["PosX:",{"$f":"LEFT(B3,1)","v":"H"},null,"PosX",{"$f":"FIND(B3,E2)","v":1},{"$f":"Logik!G1","v":"C1"},"C1",false,"","H7H6H5","",false,"","G6","","","C1",0,{"$f":"IF(P4<>\"\",OFFSET(Logik!$D$4,0,ROW()-1),0)","v":0},{"$f":"SUBSTITUTE(T3,G4,\"\")&IF(IFERROR(FIND(G4,N4)>0,FALSE),G4,\"\")","v":"H7H6H5"}]
["PosY:",{"$f":"RIGHT(B3,1)","v":"7"},null,"PosY",{"$f":"IFERROR(FIND(B3,E3),0)","v":0},{"$f":"Logik!H1","v":"D1"},"D1",false,"","H7H6H5","",false,"","G6","","","D1",0,{"$f":"IF(P5<>\"\",OFFSET(Logik!$D$4,0,ROW()-1),0)","v":0},"H7H6H5"]
[null,null,null,"RX",{"$f":"K33&J33","v":"H7H6H5"},{"$f":"Logik!I1","v":"E1"},"E1",false,"","H7H6H5","",false,"","G6","","","E1",0,{"$f":"IF(P6<>\"\",OFFSET(Logik!$D$4,0,ROW()-1),0)","v":0},"H7H6H5"]
["Poäng",{"$f":"Logik!AB3","v":100},null,"RA",{"$f":"O33&N33","v":"G6"},{"$f":"Logik!J1","v":"F1"},"F1",false,"","H7H6H5","",false,"","G6","","","F1",0,{"$f":"IF(P7<>\"\",OFFSET(Logik!$D$4,0,ROW()-1),0)","v":0},"H7H6H5"]
["PosPoäng",{"$f":"Logik!AB4","v":0},null,"RXY",{"$f":"E6&E7","v":"H7H6H5G6"},{"$f":"Logik!K1","v":"G1"},"G1",false,"","H7H6H5","",false,"","G6","","","G1",0,{"$f":"IF(P8<>\"\",OFFSET(Logik!$D$4,0,ROW()-1),0)","v":0},"H7H6H5"]
[null,null,null,"Försvar",{"$f":"SUM(R18:R33)+SUM(S18:S33)","v":0},{"$f":"Logik!L1","v":"H1"},"H1",false,"","H7H6H5","",false,"","G6","","","H1",0,{"$f":"IF(P9<>\"\",OFFSET(Logik!$D$4,0,ROW()-1),0)","v":0},"H7H6H5"]
[null,null,null,"Attack",{"$f":"SUM(R2:R17)+SUM(S2:S17)","v":0},{"$f":"Logik!M1","v":"A2"},"A2",false,"","H7H6H5","",false,"","G6","","","A2",0,{"$f":"IF(P10<>\"\",OFFSET(Logik!$D$4,0,ROW()-1),0)","v":0},"H7H6H5"]
[null,null,null,"R Antal",{"$f":"LEN(E8)/2","v":4},{"$f":"Logik!N1","v":"B2"},"B2",false,"","H7H6H5","",false,"","G6","","","B2",0,{"$f":"IF(P11<>\"\",OFFSET(Logik!$D$4,0,ROW()-1),0)","v":0},"H7H6H5"]
[null,null,null,null,null,{"$f":"Logik!O1","v":"C2"},"C2",false,"","H7H6H5","",false,"","G6","","","C2",0,{"$f":"IF(P12<>\"\",OFFSET(Logik!$D$4,0,ROW()-1),0)","v":0},"H7H6H5"]
[null,null,null,"MöjligaDrag",{"$f":"T33","v":"H6H5"},{"$f":"Logik!P1","v":"D2"},"D2",false,"","H7H6H5","",false,"","G6","","","D2",0,{"$f":"IF(P13<>\"\",OFFSET(Logik!$D$4,0,ROW()-1),0)","v":0},"H7H6H5"]
[null,null,null,"D Antal",{"$f":"LEN(E13)/2","v":2},{"$f":"Logik!Q1","v":"E2"},"E2",false,"","H7H6H5","",false,"","G6","","","E2",0,{"$f":"IF(P14<>\"\",OFFSET(Logik!$D$4,0,ROW()-1),0)","v":0},"H7H6H5"]
[null,null,null,null,null,{"$f":"Logik!R1","v":"F2"},"F2",false,"","H7H6H5","",false,"","G6","","","F2",0,{"$f":"IF(P15<>\"\",OFFSET(Logik!$D$4,0,ROW()-1),0)","v":0},"H7H6H5"]
[null,null,null,null,null,{"$f":"Logik!S1","v":"G2"},"G2",false,"","H7H6H5","",false,"","G6","","","G2",0,{"$f":"IF(P16<>\"\",OFFSET(Logik!$D$4,0,ROW()-1),0)","v":0},"H7H6H5"]
[null,null,null,null,null,{"$f":"Logik!T1","v":"H2"},"H2",false,"","H7H6H5","",false,"","G6","","","H2",0,{"$f":"IF(P17<>\"\",OFFSET(Logik!$D$4,0,ROW()-1),0)","v":0},"H7H6H5"]
[null,null,null,null,null,{"$f":"Logik!U1","v":"A7"},"A7",false,"","H7H6H5","",false,"","G6","","","A7",{"$f":"IF(P18<>\"\",HLOOKUP(HLOOKUP(Q18,PjasStart,2,FALSE),Pjaser,4,FALSE),0)","v":0},{"$f":"IF(P18<>\"\",OFFSET(Logik!$D$4,0,ROW()-1),0)","v":0},{"$f":"SUBSTITUTE(T17,G18,\"\")","v":"H7H6H5"}]
[null,null,null,null,null,{"$f":"Logik!V1","v":"B7"},"B7",false,"","H7H6H5","",false,"","G6","","","B7",0,{"$f":"IF(P19<>\"\",OFFSET(Logik!$D$4,0,ROW()-1),0)","v":0},{"$f":"SUBSTITUTE(T18,G19,\"\")","v":"H7H6H5"}]
[null,null,null,null,null,{"$f":"Logik!W1","v":"C7"},"C7",false,"","H7H6H5","",false,"","G6","","","C7",0,{"$f":"IF(P20<>\"\",OFFSET(Logik!$D$4,0,ROW()-1),0)","v":0},{"$f":"SUBSTITUTE(T19,G20,\"\")","v":"H7H6H5"}]
[null,null,null,null,null,{"$f":"Logik!X1","v":"D7"},"D7",false,"","H7H6H5","",false,"","G6","","","D7",0,{"$f":"IF(P21<>\"\",OFFSET(Logik!$D$4,0,ROW()-1),0)","v":0},"H7H6H5"]
[null,null,null,null,null,{"$f":"Logik!Y1","v":"E7"},"E7",false,"","H7H6H5","",false,"","G6","","","E7",0,{"$f":"IF(P22<>\"\",OFFSET(Logik!$D$4,0,ROW()-1),0)","v":0},"H7H6H5"]
[null,null,null,null,null,{"$f":"Logik!Z1","v":"F7"},"F7",false,"","H7H6H5","",false,"","G6","","","F7",0,{"$f":"IF(P23<>\"\",OFFSET(Logik!$D$4,0,ROW()-1),0)","v":0},"H7H6H5"]
[null,null,null,null,null,{"$f":"Logik!AA1","v":"G7"},"G7",false,"","H7H6H5","",false,"","G6","","","G7",0,{"$f":"IF(P24<>\"\",OFFSET(Logik!$D$4,0,ROW()-1),0)","v":0},"H7H6H5"]
[null,null,null,null,null,{"$f":"Logik!AB1","v":"H7"},"H7",false,"","H7H6H5","",false,"","G6","","","H7",0,{"$f":"IF(P25<>\"\",OFFSET(Logik!$D$4,0,ROW()-1),0)","v":0},"H6H5"]
[null,null,null,null,null,{"$f":"Logik!AC1","v":"A8"},"A8",false,"","H7H6H5","",false,"","G6","","","A8",0,{"$f":"IF(P26<>\"\",OFFSET(Logik!$D$4,0,ROW()-1),0)","v":0},"H6H5"]
[null,null,null,null,null,{"$f":"Logik!AD1","v":"B8"},"B8",false,"","H7H6H5","",false,"","G6","","","B8",0,{"$f":"IF(P27<>\"\",OFFSET(Logik!$D$4,0,ROW()-1),0)","v":0},"H6H5"]
[null,null,null,null,null,{"$f":"Logik!AE1","v":"C8"},"C8",false,"","H7H6H5","",false,"","G6","","","C8",0,{"$f":"IF(P28<>\"\",OFFSET(Logik!$D$4,0,ROW()-1),0)","v":0},"H6H5"]
[null,null,null,null,null,{"$f":"Logik!AF1","v":"D8"},"D8",false,"","H7H6H5","",false,"","G6","","","D8",0,{"$f":"IF(P29<>\"\",OFFSET(Logik!$D$4,0,ROW()-1),0)","v":0},"H6H5"]
[null,null,null,null,null,{"$f":"Logik!AG1","v":"E8"},"E8",false,"","H7H6H5","",false,"","G6","","","E8",0,{"$f":"IF(P30<>\"\",OFFSET(Logik!$D$4,0,ROW()-1),0)","v":0},"H6H5"]
[null,null,null,null,null,{"$f":"Logik!AH1","v":"F8"},"F8",false,"","H7H6H5","",false,"","G6","","","F8",0,{"$f":"IF(P31<>\"\",OFFSET(Logik!$D$4,0,ROW()-1),0)","v":0},"H6H5"]
[null,null,null,null,null,{"$f":"Logik!AI1","v":"G8"},"G8",false,"","H7H6H5","",false,"","G6","","","G8",0,{"$f":"IF(P32<>\"\",OFFSET(Logik!$D$4,0,ROW()-1),0)","v":0},"H6H5"]
[null,null,null,null,null,{"$f":"Logik!AJ1","v":"H8"},"H8",false,"","H7H6H5","",false,"","G6","","","H8",0,{"$f":"IF(P33<>\"\",OFFSET(Logik!$D$4,0,ROW()-1),0)","v":0},"H6H5"]

{"sheet":"Blad11","index":45,"n_rows":2,"n_cols":1,"rows_kept":2,"cut":false,"hidden":true,"merged":[]}
[{"$f":"Stat!J20*Blad11!A2","v":18}]
[1.5]